View Issue Details

IDProjectCategoryView StatusLast Update
0007290Talerexchangepublic2022-08-18 05:48
Reporterttn Assigned Tottn  
PrioritynormalSeverityminorReproducibilityhave not tried
Status feedbackResolutionopen 
PlatformLinuxOSDebianOS Version11 (Bullseye)
Product Versiongit (master) 
Summary0007290: "make check" fails for tests test_auditor_api_{cs,rsa}
DescriptionThis is with GNUnet HEAD == 059a92168bd4d765d19b4f2fcfc8b451d9abdca5,
exchange HEAD == dc26b2db4cecbca155f5df2678f60aadf13c3bd4.
Logs attached.
TagsNo tags attached.

Activities

ttn

2022-07-29 07:25

developer  

.ttn.exchange-make-check.log (18,106 bytes)   
+ export PATH=/home/ttn/te/bin:/home/ttn/build/GNU/T/hack:/usr/lib/postgresql/13/bin:/home/ttn/bin:/usr/local/bin:/usr/bin:/bin:/usr/local/games:/usr/games
+ PATH=/home/ttn/te/bin:/home/ttn/build/GNU/T/hack:/usr/lib/postgresql/13/bin:/home/ttn/bin:/usr/local/bin:/usr/bin:/bin:/usr/local/games:/usr/games
+ export TMPDIR=/home/ttn/te/tmp
+ TMPDIR=/home/ttn/te/tmp
+ export PGHOST=/home/ttn/te/pg
+ PGHOST=/home/ttn/te/pg
+ make check
Makefile:961: warning: overriding recipe for target 'doxygen-doc/taler-exchange.tag'
Makefile:956: warning: ignoring old recipe for target 'doxygen-doc/taler-exchange.tag'
Makefile:966: warning: overriding recipe for target 'doxygen-doc/taler-exchange.tag'
Makefile:961: warning: ignoring old recipe for target 'doxygen-doc/taler-exchange.tag'
Makefile:971: warning: overriding recipe for target 'doxygen-doc/taler-exchange.tag'
Makefile:966: warning: ignoring old recipe for target 'doxygen-doc/taler-exchange.tag'
Making check in .
make[1]: Entering directory '/home/ttn/build/GNU/T/exchange'
Makefile:961: warning: overriding recipe for target 'doxygen-doc/taler-exchange.tag'
Makefile:956: warning: ignoring old recipe for target 'doxygen-doc/taler-exchange.tag'
Makefile:966: warning: overriding recipe for target 'doxygen-doc/taler-exchange.tag'
Makefile:961: warning: ignoring old recipe for target 'doxygen-doc/taler-exchange.tag'
Makefile:971: warning: overriding recipe for target 'doxygen-doc/taler-exchange.tag'
Makefile:966: warning: ignoring old recipe for target 'doxygen-doc/taler-exchange.tag'
make[1]: Leaving directory '/home/ttn/build/GNU/T/exchange'
Making check in contrib
make[1]: Entering directory '/home/ttn/build/GNU/T/exchange/contrib'
Making check in .
make[2]: Entering directory '/home/ttn/build/GNU/T/exchange/contrib'
make[2]: Nothing to be done for 'check-am'.
make[2]: Leaving directory '/home/ttn/build/GNU/T/exchange/contrib'
make[1]: Leaving directory '/home/ttn/build/GNU/T/exchange/contrib'
Making check in src
make[1]: Entering directory '/home/ttn/build/GNU/T/exchange/src'
Making check in include
make[2]: Entering directory '/home/ttn/build/GNU/T/exchange/src/include'
make[2]: Nothing to be done for 'check'.
make[2]: Leaving directory '/home/ttn/build/GNU/T/exchange/src/include'
Making check in util
make[2]: Entering directory '/home/ttn/build/GNU/T/exchange/src/util'
make  test_age_restriction test_amount test_crypto test_helper_eddsa test_helper_rsa test_helper_cs test_payto test_url
make[3]: Entering directory '/home/ttn/build/GNU/T/exchange/src/util'
  CC       test_age_restriction.o
  CCLD     test_age_restriction
  CC       test_amount.o
  CCLD     test_amount
  CC       test_crypto.o
  CCLD     test_crypto
  CC       test_helper_eddsa.o
  CCLD     test_helper_eddsa
  CC       test_helper_rsa.o
  CCLD     test_helper_rsa
  CC       test_helper_cs.o
  CCLD     test_helper_cs
  CC       test_payto.o
  CCLD     test_payto
  CC       test_url.o
  CCLD     test_url
make[3]: Leaving directory '/home/ttn/build/GNU/T/exchange/src/util'
make  check-TESTS
make[3]: Entering directory '/home/ttn/build/GNU/T/exchange/src/util'
make[4]: Entering directory '/home/ttn/build/GNU/T/exchange/src/util'
PASS: test_age_restriction
PASS: test_amount
PASS: test_crypto
PASS: test_helper_eddsa
PASS: test_helper_rsa
PASS: test_helper_cs
PASS: test_payto
PASS: test_url
============================================================================
Testsuite summary for taler-exchange 0.8.5
============================================================================
# TOTAL: 8
# PASS:  8
# SKIP:  0
# XFAIL: 0
# FAIL:  0
# XPASS: 0
# ERROR: 0
============================================================================
make[4]: Leaving directory '/home/ttn/build/GNU/T/exchange/src/util'
make[3]: Leaving directory '/home/ttn/build/GNU/T/exchange/src/util'
make[2]: Leaving directory '/home/ttn/build/GNU/T/exchange/src/util'
Making check in json
make[2]: Entering directory '/home/ttn/build/GNU/T/exchange/src/json'
make  test_json test_json_wire
make[3]: Entering directory '/home/ttn/build/GNU/T/exchange/src/json'
  CC       test_json.o
  CCLD     test_json
  CC       test_json_wire.o
  CCLD     test_json_wire
make[3]: Leaving directory '/home/ttn/build/GNU/T/exchange/src/json'
make  check-TESTS
make[3]: Entering directory '/home/ttn/build/GNU/T/exchange/src/json'
make[4]: Entering directory '/home/ttn/build/GNU/T/exchange/src/json'
PASS: test_json
PASS: test_json_wire
============================================================================
Testsuite summary for taler-exchange 0.8.5
============================================================================
# TOTAL: 2
# PASS:  2
# SKIP:  0
# XFAIL: 0
# FAIL:  0
# XPASS: 0
# ERROR: 0
============================================================================
make[4]: Leaving directory '/home/ttn/build/GNU/T/exchange/src/json'
make[3]: Leaving directory '/home/ttn/build/GNU/T/exchange/src/json'
make[2]: Leaving directory '/home/ttn/build/GNU/T/exchange/src/json'
Making check in extensions
make[2]: Entering directory '/home/ttn/build/GNU/T/exchange/src/extensions'
make[2]: Nothing to be done for 'check'.
make[2]: Leaving directory '/home/ttn/build/GNU/T/exchange/src/extensions'
Making check in curl
make[2]: Entering directory '/home/ttn/build/GNU/T/exchange/src/curl'
make[2]: Nothing to be done for 'check'.
make[2]: Leaving directory '/home/ttn/build/GNU/T/exchange/src/curl'
Making check in pq
make[2]: Entering directory '/home/ttn/build/GNU/T/exchange/src/pq'
make  test_pq
make[3]: Entering directory '/home/ttn/build/GNU/T/exchange/src/pq'
  CC       test_pq.o
  CCLD     test_pq
make[3]: Leaving directory '/home/ttn/build/GNU/T/exchange/src/pq'
make  check-TESTS
make[3]: Entering directory '/home/ttn/build/GNU/T/exchange/src/pq'
make[4]: Entering directory '/home/ttn/build/GNU/T/exchange/src/pq'
PASS: test_pq
============================================================================
Testsuite summary for taler-exchange 0.8.5
============================================================================
# TOTAL: 1
# PASS:  1
# SKIP:  0
# XFAIL: 0
# FAIL:  0
# XPASS: 0
# ERROR: 0
============================================================================
make[4]: Leaving directory '/home/ttn/build/GNU/T/exchange/src/pq'
make[3]: Leaving directory '/home/ttn/build/GNU/T/exchange/src/pq'
make[2]: Leaving directory '/home/ttn/build/GNU/T/exchange/src/pq'
Making check in sq
make[2]: Entering directory '/home/ttn/build/GNU/T/exchange/src/sq'
make  test_sq
make[3]: Entering directory '/home/ttn/build/GNU/T/exchange/src/sq'
  CC       test_sq.o
  CCLD     test_sq
make[3]: Leaving directory '/home/ttn/build/GNU/T/exchange/src/sq'
make  check-TESTS
make[3]: Entering directory '/home/ttn/build/GNU/T/exchange/src/sq'
make[4]: Entering directory '/home/ttn/build/GNU/T/exchange/src/sq'
PASS: test_sq
============================================================================
Testsuite summary for taler-exchange 0.8.5
============================================================================
# TOTAL: 1
# PASS:  1
# SKIP:  0
# XFAIL: 0
# FAIL:  0
# XPASS: 0
# ERROR: 0
============================================================================
make[4]: Leaving directory '/home/ttn/build/GNU/T/exchange/src/sq'
make[3]: Leaving directory '/home/ttn/build/GNU/T/exchange/src/sq'
make[2]: Leaving directory '/home/ttn/build/GNU/T/exchange/src/sq'
Making check in mhd
make[2]: Entering directory '/home/ttn/build/GNU/T/exchange/src/mhd'
make[2]: Nothing to be done for 'check'.
make[2]: Leaving directory '/home/ttn/build/GNU/T/exchange/src/mhd'
Making check in bank-lib
make[2]: Entering directory '/home/ttn/build/GNU/T/exchange/src/bank-lib'
make  test_bank.sh
make[3]: Entering directory '/home/ttn/build/GNU/T/exchange/src/bank-lib'
make[3]: Nothing to be done for 'test_bank.sh'.
make[3]: Leaving directory '/home/ttn/build/GNU/T/exchange/src/bank-lib'
make  check-TESTS
make[3]: Entering directory '/home/ttn/build/GNU/T/exchange/src/bank-lib'
make[4]: Entering directory '/home/ttn/build/GNU/T/exchange/src/bank-lib'
PASS: test_bank.sh
============================================================================
Testsuite summary for taler-exchange 0.8.5
============================================================================
# TOTAL: 1
# PASS:  1
# SKIP:  0
# XFAIL: 0
# FAIL:  0
# XPASS: 0
# ERROR: 0
============================================================================
make[4]: Leaving directory '/home/ttn/build/GNU/T/exchange/src/bank-lib'
make[3]: Leaving directory '/home/ttn/build/GNU/T/exchange/src/bank-lib'
make[2]: Leaving directory '/home/ttn/build/GNU/T/exchange/src/bank-lib'
Making check in exchangedb
make[2]: Entering directory '/home/ttn/build/GNU/T/exchange/src/exchangedb'
make  check-am
make[3]: Entering directory '/home/ttn/build/GNU/T/exchange/src/exchangedb'
make  test-exchangedb-postgres bench-db-postgres
make[4]: Entering directory '/home/ttn/build/GNU/T/exchange/src/exchangedb'
  CC       test_exchangedb.o
  CCLD     test-exchangedb-postgres
  CC       bench_db.o
  CCLD     bench-db-postgres
make[4]: Leaving directory '/home/ttn/build/GNU/T/exchange/src/exchangedb'
make  check-TESTS
make[4]: Entering directory '/home/ttn/build/GNU/T/exchange/src/exchangedb'
make[5]: Entering directory '/home/ttn/build/GNU/T/exchange/src/exchangedb'
SKIP: test-exchangedb-postgres
============================================================================
Testsuite summary for taler-exchange 0.8.5
============================================================================
# TOTAL: 1
# PASS:  0
# SKIP:  1
# XFAIL: 0
# FAIL:  0
# XPASS: 0
# ERROR: 0
============================================================================
make[5]: Leaving directory '/home/ttn/build/GNU/T/exchange/src/exchangedb'
make[4]: Leaving directory '/home/ttn/build/GNU/T/exchange/src/exchangedb'
make[3]: Leaving directory '/home/ttn/build/GNU/T/exchange/src/exchangedb'
make[2]: Leaving directory '/home/ttn/build/GNU/T/exchange/src/exchangedb'
Making check in exchange
make[2]: Entering directory '/home/ttn/build/GNU/T/exchange/src/exchange'
make  test_taler_exchange_httpd.sh 
make[3]: Entering directory '/home/ttn/build/GNU/T/exchange/src/exchange'
make[3]: Nothing to be done for 'test_taler_exchange_httpd.sh'.
make[3]: Leaving directory '/home/ttn/build/GNU/T/exchange/src/exchange'
make  check-TESTS
make[3]: Entering directory '/home/ttn/build/GNU/T/exchange/src/exchange'
make[4]: Entering directory '/home/ttn/build/GNU/T/exchange/src/exchange'
SKIP: test_taler_exchange_httpd.sh
============================================================================
Testsuite summary for taler-exchange 0.8.5
============================================================================
# TOTAL: 1
# PASS:  0
# SKIP:  1
# XFAIL: 0
# FAIL:  0
# XPASS: 0
# ERROR: 0
============================================================================
make[4]: Leaving directory '/home/ttn/build/GNU/T/exchange/src/exchange'
make[3]: Leaving directory '/home/ttn/build/GNU/T/exchange/src/exchange'
make[2]: Leaving directory '/home/ttn/build/GNU/T/exchange/src/exchange'
Making check in auditordb
make[2]: Entering directory '/home/ttn/build/GNU/T/exchange/src/auditordb'
make  test-auditordb-postgres
make[3]: Entering directory '/home/ttn/build/GNU/T/exchange/src/auditordb'
  CC       test_auditordb.o
  CCLD     test-auditordb-postgres
make[3]: Leaving directory '/home/ttn/build/GNU/T/exchange/src/auditordb'
make  check-TESTS
make[3]: Entering directory '/home/ttn/build/GNU/T/exchange/src/auditordb'
make[4]: Entering directory '/home/ttn/build/GNU/T/exchange/src/auditordb'
PASS: test-auditordb-postgres
============================================================================
Testsuite summary for taler-exchange 0.8.5
============================================================================
# TOTAL: 1
# PASS:  1
# SKIP:  0
# XFAIL: 0
# FAIL:  0
# XPASS: 0
# ERROR: 0
============================================================================
make[4]: Leaving directory '/home/ttn/build/GNU/T/exchange/src/auditordb'
make[3]: Leaving directory '/home/ttn/build/GNU/T/exchange/src/auditordb'
make[2]: Leaving directory '/home/ttn/build/GNU/T/exchange/src/auditordb'
Making check in auditor
make[2]: Entering directory '/home/ttn/build/GNU/T/exchange/src/auditor'
make  test-auditor.sh test-revocation.sh test-sync.sh
make[3]: Entering directory '/home/ttn/build/GNU/T/exchange/src/auditor'
make[3]: Nothing to be done for 'test-auditor.sh'.
make[3]: Nothing to be done for 'test-revocation.sh'.
make[3]: Nothing to be done for 'test-sync.sh'.
make[3]: Leaving directory '/home/ttn/build/GNU/T/exchange/src/auditor'
make  check-TESTS
make[3]: Entering directory '/home/ttn/build/GNU/T/exchange/src/auditor'
make[4]: Entering directory '/home/ttn/build/GNU/T/exchange/src/auditor'
SKIP: test-auditor.sh
SKIP: test-revocation.sh
PASS: test-sync.sh
============================================================================
Testsuite summary for taler-exchange 0.8.5
============================================================================
# TOTAL: 3
# PASS:  1
# SKIP:  2
# XFAIL: 0
# FAIL:  0
# XPASS: 0
# ERROR: 0
============================================================================
make[4]: Leaving directory '/home/ttn/build/GNU/T/exchange/src/auditor'
make[3]: Leaving directory '/home/ttn/build/GNU/T/exchange/src/auditor'
make[2]: Leaving directory '/home/ttn/build/GNU/T/exchange/src/auditor'
Making check in lib
make[2]: Entering directory '/home/ttn/build/GNU/T/exchange/src/lib'
make[2]: Nothing to be done for 'check'.
make[2]: Leaving directory '/home/ttn/build/GNU/T/exchange/src/lib'
Making check in exchange-tools
make[2]: Entering directory '/home/ttn/build/GNU/T/exchange/src/exchange-tools'
make[2]: Nothing to be done for 'check'.
make[2]: Leaving directory '/home/ttn/build/GNU/T/exchange/src/exchange-tools'
Making check in testing
make[2]: Entering directory '/home/ttn/build/GNU/T/exchange/src/testing'
make  test_auditor_api_cs test_auditor_api_rsa test_auditor_api_version_rsa test_auditor_api_version_cs test_bank_api_with_fakebank test_bank_api_with_nexus test_exchange_api_cs test_exchange_api_rsa test_exchange_api_keys_cherry_picking_cs test_exchange_api_keys_cherry_picking_rsa test_exchange_api_revocation_cs test_exchange_api_revocation_rsa test_exchange_api_overlapping_keys_bug_cs test_exchange_api_overlapping_keys_bug_rsa test_exchange_management_api_cs test_exchange_management_api_rsa test_kyc_api test_taler_exchange_aggregator-postgres test_taler_exchange_wirewatch-postgres test_exchange_p2p_cs test_exchange_p2p_rsa 
make[3]: Entering directory '/home/ttn/build/GNU/T/exchange/src/testing'
  CC       test_auditor_api.o
  CCLD     test_auditor_api_cs
  CCLD     test_auditor_api_rsa
  CC       test_auditor_api_version.o
  CCLD     test_auditor_api_version_rsa
  CCLD     test_auditor_api_version_cs
  CC       test_bank_api.o
  CCLD     test_bank_api_with_fakebank
  CCLD     test_bank_api_with_nexus
  CC       test_exchange_api.o
  CCLD     test_exchange_api_cs
  CCLD     test_exchange_api_rsa
  CC       test_exchange_api_keys_cherry_picking.o
  CCLD     test_exchange_api_keys_cherry_picking_cs
  CCLD     test_exchange_api_keys_cherry_picking_rsa
  CC       test_exchange_api_revocation.o
  CCLD     test_exchange_api_revocation_cs
  CCLD     test_exchange_api_revocation_rsa
  CC       test_exchange_api_overlapping_keys_bug.o
  CCLD     test_exchange_api_overlapping_keys_bug_cs
  CCLD     test_exchange_api_overlapping_keys_bug_rsa
  CC       test_exchange_management_api.o
  CCLD     test_exchange_management_api_cs
  CCLD     test_exchange_management_api_rsa
  CC       test_kyc_api.o
  CCLD     test_kyc_api
  CC       test_taler_exchange_aggregator.o
  CCLD     test_taler_exchange_aggregator-postgres
  CC       test_taler_exchange_wirewatch.o
  CCLD     test_taler_exchange_wirewatch-postgres
  CC       test_exchange_p2p.o
  CCLD     test_exchange_p2p_cs
  CCLD     test_exchange_p2p_rsa
make[3]: Leaving directory '/home/ttn/build/GNU/T/exchange/src/testing'
make  check-TESTS
make[3]: Entering directory '/home/ttn/build/GNU/T/exchange/src/testing'
make[4]: Entering directory '/home/ttn/build/GNU/T/exchange/src/testing'
FAIL: test_auditor_api_cs
FAIL: test_auditor_api_rsa
PASS: test_auditor_api_version_rsa
PASS: test_auditor_api_version_cs
PASS: test_bank_api_with_fakebank
SKIP: test_bank_api_with_nexus
FAIL: test_exchange_api_cs
FAIL: test_exchange_api_rsa
SKIP: test_exchange_api_keys_cherry_picking_cs
SKIP: test_exchange_api_keys_cherry_picking_rsa
SKIP: test_exchange_api_revocation_cs
SKIP: test_exchange_api_revocation_rsa
SKIP: test_exchange_api_overlapping_keys_bug_cs
SKIP: test_exchange_api_overlapping_keys_bug_rsa
SKIP: test_exchange_management_api_cs
SKIP: test_exchange_management_api_rsa
SKIP: test_kyc_api
SKIP: test_taler_exchange_aggregator-postgres
SKIP: test_taler_exchange_wirewatch-postgres
FAIL: test_exchange_p2p_cs
FAIL: test_exchange_p2p_rsa
============================================================================
Testsuite summary for taler-exchange 0.8.5
============================================================================
# TOTAL: 21
# PASS:  3
# SKIP:  12
# XFAIL: 0
# FAIL:  6
# XPASS: 0
# ERROR: 0
============================================================================
See src/testing/test-suite.log
Please report to taler-bug@gnunet.org
============================================================================
make[4]: *** [Makefile:1979: test-suite.log] Error 1
make[4]: Leaving directory '/home/ttn/build/GNU/T/exchange/src/testing'
make[3]: *** [Makefile:2087: check-TESTS] Error 2
make[3]: Leaving directory '/home/ttn/build/GNU/T/exchange/src/testing'
make[2]: *** [Makefile:2322: check-am] Error 2
make[2]: Leaving directory '/home/ttn/build/GNU/T/exchange/src/testing'
make[1]: *** [Makefile:522: check-recursive] Error 1
make[1]: Leaving directory '/home/ttn/build/GNU/T/exchange/src'
make: *** [Makefile:507: check-recursive] Error 1
.ttn.exchange-make-check.log (18,106 bytes)   
test-suite.log (28,061 bytes)   
======================================================
   taler-exchange 0.8.5: src/testing/test-suite.log
======================================================

# TOTAL: 21
# PASS:  3
# SKIP:  12
# XFAIL: 0
# FAIL:  6
# XPASS: 0
# ERROR: 0

.. contents:: :depth: 2

FAIL: test_auditor_api_cs
=========================

2022-07-29T06:47:03.538556+0200 /home/ttn/build/GNU/T/exchange/src/testing/.libs/test_auditor_api_cs-101246 INFO Using fakebank http://localhost:8082/2/ on port 8082
2022-07-29T06:47:03.538832+0200 /home/ttn/build/GNU/T/exchange/src/testing/.libs/test_auditor_api_cs-101246 INFO exchange payto: payto://x-taler-bank/localhost/2?receiver-name=2
2022-07-29T06:47:03.538848+0200 /home/ttn/build/GNU/T/exchange/src/testing/.libs/test_auditor_api_cs-101246 INFO user42_payto: payto://x-taler-bank/localhost/42?receiver-name=42
2022-07-29T06:47:03.538858+0200 /home/ttn/build/GNU/T/exchange/src/testing/.libs/test_auditor_api_cs-101246 INFO user43_payto: payto://x-taler-bank/localhost/43?receiver-name=43
psql:/home/ttn/te/share/taler/sql/exchange/drop.sql:23: ERROR:  schema "exchange" does not exist
2022-07-29T06:47:03.592491+0200 taler-exchange-dbinit-101260 WARNING Could not run PSQL on file /home/ttn/te/share/taler//sql/exchange/drop.sql: psql exit code was 3
2022-07-29T06:47:03.592616+0200 taler-exchange-dbinit-101260 ERROR Could not drop tables as requested. Either database was not yet initialized, or permission denied. Consult the logs. Will still try to create new tables.
psql:/home/ttn/te/share/taler/sql/exchange/procedures.sql:246: ERROR:  no schema has been selected to create in
2022-07-29T06:47:03.613732+0200 taler-exchange-dbinit-101260 WARNING Could not run PSQL on file /home/ttn/te/share/taler//sql/exchange/procedures.sql: psql exit code was 3
Failed to initialize database.
2022-07-29T06:47:03.614985+0200 /home/ttn/build/GNU/T/exchange/src/testing/.libs/test_auditor_api_cs-101246 ERROR Failed to setup (exchange) database, exit code 4
FAIL test_auditor_api_cs (exit status: 78)

FAIL: test_auditor_api_rsa
==========================

2022-07-29T06:47:03.648815+0200 /home/ttn/build/GNU/T/exchange/src/testing/.libs/test_auditor_api_rsa-101272 INFO Using fakebank http://localhost:8082/2/ on port 8082
2022-07-29T06:47:03.649130+0200 /home/ttn/build/GNU/T/exchange/src/testing/.libs/test_auditor_api_rsa-101272 INFO exchange payto: payto://x-taler-bank/localhost/2?receiver-name=2
2022-07-29T06:47:03.649149+0200 /home/ttn/build/GNU/T/exchange/src/testing/.libs/test_auditor_api_rsa-101272 INFO user42_payto: payto://x-taler-bank/localhost/42?receiver-name=42
2022-07-29T06:47:03.649160+0200 /home/ttn/build/GNU/T/exchange/src/testing/.libs/test_auditor_api_rsa-101272 INFO user43_payto: payto://x-taler-bank/localhost/43?receiver-name=43
psql:/home/ttn/te/share/taler/sql/exchange/drop.sql:23: ERROR:  schema "exchange" does not exist
2022-07-29T06:47:03.697255+0200 taler-exchange-dbinit-101286 WARNING Could not run PSQL on file /home/ttn/te/share/taler//sql/exchange/drop.sql: psql exit code was 3
2022-07-29T06:47:03.697403+0200 taler-exchange-dbinit-101286 ERROR Could not drop tables as requested. Either database was not yet initialized, or permission denied. Consult the logs. Will still try to create new tables.
psql:/home/ttn/te/share/taler/sql/exchange/procedures.sql:246: ERROR:  no schema has been selected to create in
2022-07-29T06:47:03.716764+0200 taler-exchange-dbinit-101286 WARNING Could not run PSQL on file /home/ttn/te/share/taler//sql/exchange/procedures.sql: psql exit code was 3
Failed to initialize database.
2022-07-29T06:47:03.718206+0200 /home/ttn/build/GNU/T/exchange/src/testing/.libs/test_auditor_api_rsa-101272 ERROR Failed to setup (exchange) database, exit code 4
FAIL test_auditor_api_rsa (exit status: 78)

SKIP: test_bank_api_with_nexus
==============================

2022-07-29T06:47:33.019942+0200 test-bank-api-101435 INFO Relying on nexus http://localhost:5001/facades/my-facade/taler/ on port 5001
2022-07-29T06:47:33.020050+0200 test-bank-api-101435 INFO exchange payto: payto://iban/BIC/ES9121000418450200051332?receiver-name=Exchange
2022-07-29T06:47:33.020066+0200 test-bank-api-101435 INFO user42_payto: payto://iban/BIC/FR7630006000011234567890189?receiver-name=User42
2022-07-29T06:47:33.020077+0200 test-bank-api-101435 INFO user42_payto: payto://iban/BIC/GB33BUKB20201555555555?receiver-name=User43
2022-07-29T06:47:33.020126+0200 util-os-installation-101435 INFO Could not find binary `libeufin-nexus' in PATH!
2022-07-29T06:47:33.020142+0200 test-bank-api-101435 WARNING `exec' failed on file `libeufin-nexus' at testing_api_helpers_bank.c:106 with error: No such file or directory
SKIP test_bank_api_with_nexus (exit status: 77)

FAIL: test_exchange_api_cs
==========================

2022-07-29T06:47:33.050258+0200 /home/ttn/build/GNU/T/exchange/src/testing/.libs/test_exchange_api_cs-101456 INFO Using fakebank http://localhost:9081/2/ on port 9081
2022-07-29T06:47:33.050535+0200 /home/ttn/build/GNU/T/exchange/src/testing/.libs/test_exchange_api_cs-101456 INFO exchange payto: payto://x-taler-bank/localhost/2?receiver-name=2
2022-07-29T06:47:33.050552+0200 /home/ttn/build/GNU/T/exchange/src/testing/.libs/test_exchange_api_cs-101456 INFO user42_payto: payto://x-taler-bank/localhost/42?receiver-name=42
2022-07-29T06:47:33.050562+0200 /home/ttn/build/GNU/T/exchange/src/testing/.libs/test_exchange_api_cs-101456 INFO user43_payto: payto://x-taler-bank/localhost/43?receiver-name=43
psql:/home/ttn/te/share/taler/sql/exchange/drop.sql:23: ERROR:  schema "exchange" does not exist
2022-07-29T06:47:33.096291+0200 taler-exchange-dbinit-101470 WARNING Could not run PSQL on file /home/ttn/te/share/taler//sql/exchange/drop.sql: psql exit code was 3
2022-07-29T06:47:33.096431+0200 taler-exchange-dbinit-101470 ERROR Could not drop tables as requested. Either database was not yet initialized, or permission denied. Consult the logs. Will still try to create new tables.
psql:/home/ttn/te/share/taler/sql/exchange/procedures.sql:246: ERROR:  no schema has been selected to create in
2022-07-29T06:47:33.114478+0200 taler-exchange-dbinit-101470 WARNING Could not run PSQL on file /home/ttn/te/share/taler//sql/exchange/procedures.sql: psql exit code was 3
Failed to initialize database.
2022-07-29T06:47:33.115996+0200 /home/ttn/build/GNU/T/exchange/src/testing/.libs/test_exchange_api_cs-101456 ERROR Failed to setup (exchange) database, exit code 4
FAIL test_exchange_api_cs (exit status: 78)

FAIL: test_exchange_api_rsa
===========================

2022-07-29T06:47:33.143455+0200 /home/ttn/build/GNU/T/exchange/src/testing/.libs/test_exchange_api_rsa-101482 INFO Using fakebank http://localhost:9081/2/ on port 9081
2022-07-29T06:47:33.143734+0200 /home/ttn/build/GNU/T/exchange/src/testing/.libs/test_exchange_api_rsa-101482 INFO exchange payto: payto://x-taler-bank/localhost/2?receiver-name=2
2022-07-29T06:47:33.143750+0200 /home/ttn/build/GNU/T/exchange/src/testing/.libs/test_exchange_api_rsa-101482 INFO user42_payto: payto://x-taler-bank/localhost/42?receiver-name=42
2022-07-29T06:47:33.143760+0200 /home/ttn/build/GNU/T/exchange/src/testing/.libs/test_exchange_api_rsa-101482 INFO user43_payto: payto://x-taler-bank/localhost/43?receiver-name=43
psql:/home/ttn/te/share/taler/sql/exchange/drop.sql:23: ERROR:  schema "exchange" does not exist
2022-07-29T06:47:33.180298+0200 taler-exchange-dbinit-101496 WARNING Could not run PSQL on file /home/ttn/te/share/taler//sql/exchange/drop.sql: psql exit code was 3
2022-07-29T06:47:33.180425+0200 taler-exchange-dbinit-101496 ERROR Could not drop tables as requested. Either database was not yet initialized, or permission denied. Consult the logs. Will still try to create new tables.
psql:/home/ttn/te/share/taler/sql/exchange/procedures.sql:246: ERROR:  no schema has been selected to create in
2022-07-29T06:47:33.197118+0200 taler-exchange-dbinit-101496 WARNING Could not run PSQL on file /home/ttn/te/share/taler//sql/exchange/procedures.sql: psql exit code was 3
Failed to initialize database.
2022-07-29T06:47:33.198611+0200 /home/ttn/build/GNU/T/exchange/src/testing/.libs/test_exchange_api_rsa-101482 ERROR Failed to setup (exchange) database, exit code 4
FAIL test_exchange_api_rsa (exit status: 78)

SKIP: test_exchange_api_keys_cherry_picking_cs
==============================================

psql:/home/ttn/te/share/taler/sql/exchange/drop.sql:23: ERROR:  schema "exchange" does not exist
2022-07-29T06:47:33.268608+0200 taler-exchange-dbinit-101522 WARNING Could not run PSQL on file /home/ttn/te/share/taler//sql/exchange/drop.sql: psql exit code was 3
2022-07-29T06:47:33.268739+0200 taler-exchange-dbinit-101522 ERROR Could not drop tables as requested. Either database was not yet initialized, or permission denied. Consult the logs. Will still try to create new tables.
psql:/home/ttn/te/share/taler/sql/exchange/procedures.sql:246: ERROR:  no schema has been selected to create in
2022-07-29T06:47:33.288960+0200 taler-exchange-dbinit-101522 WARNING Could not run PSQL on file /home/ttn/te/share/taler//sql/exchange/procedures.sql: psql exit code was 3
Failed to initialize database.
2022-07-29T06:47:33.290145+0200 /home/ttn/build/GNU/T/exchange/src/testing/.libs/test_exchange_api_keys_cherry_picking_cs-101508 ERROR Failed to setup (exchange) database, exit code 4
SKIP test_exchange_api_keys_cherry_picking_cs (exit status: 77)

SKIP: test_exchange_api_keys_cherry_picking_rsa
===============================================

psql:/home/ttn/te/share/taler/sql/exchange/drop.sql:23: ERROR:  schema "exchange" does not exist
2022-07-29T06:47:33.368608+0200 taler-exchange-dbinit-101548 WARNING Could not run PSQL on file /home/ttn/te/share/taler//sql/exchange/drop.sql: psql exit code was 3
2022-07-29T06:47:33.368740+0200 taler-exchange-dbinit-101548 ERROR Could not drop tables as requested. Either database was not yet initialized, or permission denied. Consult the logs. Will still try to create new tables.
psql:/home/ttn/te/share/taler/sql/exchange/procedures.sql:246: ERROR:  no schema has been selected to create in
2022-07-29T06:47:33.387476+0200 taler-exchange-dbinit-101548 WARNING Could not run PSQL on file /home/ttn/te/share/taler//sql/exchange/procedures.sql: psql exit code was 3
Failed to initialize database.
2022-07-29T06:47:33.388770+0200 /home/ttn/build/GNU/T/exchange/src/testing/.libs/test_exchange_api_keys_cherry_picking_rsa-101534 ERROR Failed to setup (exchange) database, exit code 4
SKIP test_exchange_api_keys_cherry_picking_rsa (exit status: 77)

SKIP: test_exchange_api_revocation_cs
=====================================

2022-07-29T06:47:33.419737+0200 /home/ttn/build/GNU/T/exchange/src/testing/.libs/test_exchange_api_revocation_cs-101560 INFO Using fakebank http://localhost:9081/2/ on port 9081
2022-07-29T06:47:33.420032+0200 /home/ttn/build/GNU/T/exchange/src/testing/.libs/test_exchange_api_revocation_cs-101560 INFO exchange payto: payto://x-taler-bank/localhost/2?receiver-name=2
2022-07-29T06:47:33.420051+0200 /home/ttn/build/GNU/T/exchange/src/testing/.libs/test_exchange_api_revocation_cs-101560 INFO user42_payto: payto://x-taler-bank/localhost/42?receiver-name=42
2022-07-29T06:47:33.420062+0200 /home/ttn/build/GNU/T/exchange/src/testing/.libs/test_exchange_api_revocation_cs-101560 INFO user43_payto: payto://x-taler-bank/localhost/43?receiver-name=43
psql:/home/ttn/te/share/taler/sql/exchange/drop.sql:23: ERROR:  schema "exchange" does not exist
2022-07-29T06:47:33.459907+0200 taler-exchange-dbinit-101574 WARNING Could not run PSQL on file /home/ttn/te/share/taler//sql/exchange/drop.sql: psql exit code was 3
2022-07-29T06:47:33.460035+0200 taler-exchange-dbinit-101574 ERROR Could not drop tables as requested. Either database was not yet initialized, or permission denied. Consult the logs. Will still try to create new tables.
psql:/home/ttn/te/share/taler/sql/exchange/procedures.sql:246: ERROR:  no schema has been selected to create in
2022-07-29T06:47:33.480595+0200 taler-exchange-dbinit-101574 WARNING Could not run PSQL on file /home/ttn/te/share/taler//sql/exchange/procedures.sql: psql exit code was 3
Failed to initialize database.
2022-07-29T06:47:33.481884+0200 /home/ttn/build/GNU/T/exchange/src/testing/.libs/test_exchange_api_revocation_cs-101560 ERROR Failed to setup (exchange) database, exit code 4
SKIP test_exchange_api_revocation_cs (exit status: 77)

SKIP: test_exchange_api_revocation_rsa
======================================

2022-07-29T06:47:33.511773+0200 /home/ttn/build/GNU/T/exchange/src/testing/.libs/test_exchange_api_revocation_rsa-101586 INFO Using fakebank http://localhost:9081/2/ on port 9081
2022-07-29T06:47:33.512054+0200 /home/ttn/build/GNU/T/exchange/src/testing/.libs/test_exchange_api_revocation_rsa-101586 INFO exchange payto: payto://x-taler-bank/localhost/2?receiver-name=2
2022-07-29T06:47:33.512070+0200 /home/ttn/build/GNU/T/exchange/src/testing/.libs/test_exchange_api_revocation_rsa-101586 INFO user42_payto: payto://x-taler-bank/localhost/42?receiver-name=42
2022-07-29T06:47:33.512080+0200 /home/ttn/build/GNU/T/exchange/src/testing/.libs/test_exchange_api_revocation_rsa-101586 INFO user43_payto: payto://x-taler-bank/localhost/43?receiver-name=43
psql:/home/ttn/te/share/taler/sql/exchange/drop.sql:23: ERROR:  schema "exchange" does not exist
2022-07-29T06:47:33.556391+0200 taler-exchange-dbinit-101600 WARNING Could not run PSQL on file /home/ttn/te/share/taler//sql/exchange/drop.sql: psql exit code was 3
2022-07-29T06:47:33.556524+0200 taler-exchange-dbinit-101600 ERROR Could not drop tables as requested. Either database was not yet initialized, or permission denied. Consult the logs. Will still try to create new tables.
psql:/home/ttn/te/share/taler/sql/exchange/procedures.sql:246: ERROR:  no schema has been selected to create in
2022-07-29T06:47:33.576278+0200 taler-exchange-dbinit-101600 WARNING Could not run PSQL on file /home/ttn/te/share/taler//sql/exchange/procedures.sql: psql exit code was 3
Failed to initialize database.
2022-07-29T06:47:33.577547+0200 /home/ttn/build/GNU/T/exchange/src/testing/.libs/test_exchange_api_revocation_rsa-101586 ERROR Failed to setup (exchange) database, exit code 4
SKIP test_exchange_api_revocation_rsa (exit status: 77)

SKIP: test_exchange_api_overlapping_keys_bug_cs
===============================================

psql:/home/ttn/te/share/taler/sql/exchange/drop.sql:23: ERROR:  schema "exchange" does not exist
2022-07-29T06:47:33.647136+0200 taler-exchange-dbinit-101626 WARNING Could not run PSQL on file /home/ttn/te/share/taler//sql/exchange/drop.sql: psql exit code was 3
2022-07-29T06:47:33.647284+0200 taler-exchange-dbinit-101626 ERROR Could not drop tables as requested. Either database was not yet initialized, or permission denied. Consult the logs. Will still try to create new tables.
psql:/home/ttn/te/share/taler/sql/exchange/procedures.sql:246: ERROR:  no schema has been selected to create in
2022-07-29T06:47:33.666388+0200 taler-exchange-dbinit-101626 WARNING Could not run PSQL on file /home/ttn/te/share/taler//sql/exchange/procedures.sql: psql exit code was 3
Failed to initialize database.
2022-07-29T06:47:33.667770+0200 /home/ttn/build/GNU/T/exchange/src/testing/.libs/test_exchange_api_overlapping_keys_bug_cs-101612 ERROR Failed to setup (exchange) database, exit code 4
SKIP test_exchange_api_overlapping_keys_bug_cs (exit status: 77)

SKIP: test_exchange_api_overlapping_keys_bug_rsa
================================================

psql:/home/ttn/te/share/taler/sql/exchange/drop.sql:23: ERROR:  schema "exchange" does not exist
2022-07-29T06:47:33.739691+0200 taler-exchange-dbinit-101652 WARNING Could not run PSQL on file /home/ttn/te/share/taler//sql/exchange/drop.sql: psql exit code was 3
2022-07-29T06:47:33.739822+0200 taler-exchange-dbinit-101652 ERROR Could not drop tables as requested. Either database was not yet initialized, or permission denied. Consult the logs. Will still try to create new tables.
psql:/home/ttn/te/share/taler/sql/exchange/procedures.sql:246: ERROR:  no schema has been selected to create in
2022-07-29T06:47:33.761684+0200 taler-exchange-dbinit-101652 WARNING Could not run PSQL on file /home/ttn/te/share/taler//sql/exchange/procedures.sql: psql exit code was 3
Failed to initialize database.
2022-07-29T06:47:33.763099+0200 /home/ttn/build/GNU/T/exchange/src/testing/.libs/test_exchange_api_overlapping_keys_bug_rsa-101638 ERROR Failed to setup (exchange) database, exit code 4
SKIP test_exchange_api_overlapping_keys_bug_rsa (exit status: 77)

SKIP: test_exchange_management_api_cs
=====================================

2022-07-29T06:47:33.791716+0200 /home/ttn/build/GNU/T/exchange/src/testing/.libs/test_exchange_management_api_cs-101664 INFO Using fakebank http://localhost:9081/2/ on port 9081
2022-07-29T06:47:33.791992+0200 /home/ttn/build/GNU/T/exchange/src/testing/.libs/test_exchange_management_api_cs-101664 INFO exchange payto: payto://x-taler-bank/localhost/2?receiver-name=2
2022-07-29T06:47:33.792008+0200 /home/ttn/build/GNU/T/exchange/src/testing/.libs/test_exchange_management_api_cs-101664 INFO user42_payto: payto://x-taler-bank/localhost/42?receiver-name=42
2022-07-29T06:47:33.792018+0200 /home/ttn/build/GNU/T/exchange/src/testing/.libs/test_exchange_management_api_cs-101664 INFO user43_payto: payto://x-taler-bank/localhost/43?receiver-name=43
psql:/home/ttn/te/share/taler/sql/exchange/drop.sql:23: ERROR:  schema "exchange" does not exist
2022-07-29T06:47:33.834765+0200 taler-exchange-dbinit-101678 WARNING Could not run PSQL on file /home/ttn/te/share/taler//sql/exchange/drop.sql: psql exit code was 3
2022-07-29T06:47:33.834896+0200 taler-exchange-dbinit-101678 ERROR Could not drop tables as requested. Either database was not yet initialized, or permission denied. Consult the logs. Will still try to create new tables.
psql:/home/ttn/te/share/taler/sql/exchange/procedures.sql:246: ERROR:  no schema has been selected to create in
2022-07-29T06:47:33.854716+0200 taler-exchange-dbinit-101678 WARNING Could not run PSQL on file /home/ttn/te/share/taler//sql/exchange/procedures.sql: psql exit code was 3
Failed to initialize database.
2022-07-29T06:47:33.856492+0200 /home/ttn/build/GNU/T/exchange/src/testing/.libs/test_exchange_management_api_cs-101664 ERROR Failed to setup (exchange) database, exit code 4
SKIP test_exchange_management_api_cs (exit status: 77)

SKIP: test_exchange_management_api_rsa
======================================

2022-07-29T06:47:33.892255+0200 /home/ttn/build/GNU/T/exchange/src/testing/.libs/test_exchange_management_api_rsa-101691 INFO Using fakebank http://localhost:9081/2/ on port 9081
2022-07-29T06:47:33.892576+0200 /home/ttn/build/GNU/T/exchange/src/testing/.libs/test_exchange_management_api_rsa-101691 INFO exchange payto: payto://x-taler-bank/localhost/2?receiver-name=2
2022-07-29T06:47:33.892595+0200 /home/ttn/build/GNU/T/exchange/src/testing/.libs/test_exchange_management_api_rsa-101691 INFO user42_payto: payto://x-taler-bank/localhost/42?receiver-name=42
2022-07-29T06:47:33.892608+0200 /home/ttn/build/GNU/T/exchange/src/testing/.libs/test_exchange_management_api_rsa-101691 INFO user43_payto: payto://x-taler-bank/localhost/43?receiver-name=43
psql:/home/ttn/te/share/taler/sql/exchange/drop.sql:23: ERROR:  schema "exchange" does not exist
2022-07-29T06:47:33.939686+0200 taler-exchange-dbinit-101705 WARNING Could not run PSQL on file /home/ttn/te/share/taler//sql/exchange/drop.sql: psql exit code was 3
2022-07-29T06:47:33.939815+0200 taler-exchange-dbinit-101705 ERROR Could not drop tables as requested. Either database was not yet initialized, or permission denied. Consult the logs. Will still try to create new tables.
psql:/home/ttn/te/share/taler/sql/exchange/procedures.sql:246: ERROR:  no schema has been selected to create in
2022-07-29T06:47:33.960300+0200 taler-exchange-dbinit-101705 WARNING Could not run PSQL on file /home/ttn/te/share/taler//sql/exchange/procedures.sql: psql exit code was 3
Failed to initialize database.
2022-07-29T06:47:33.961668+0200 /home/ttn/build/GNU/T/exchange/src/testing/.libs/test_exchange_management_api_rsa-101691 ERROR Failed to setup (exchange) database, exit code 4
SKIP test_exchange_management_api_rsa (exit status: 77)

SKIP: test_kyc_api
==================

2022-07-29T06:47:33.988881+0200 test-kyc-api-101717 INFO Using fakebank http://localhost:8082/2/ on port 8082
2022-07-29T06:47:33.989149+0200 test-kyc-api-101717 INFO exchange payto: payto://x-taler-bank/localhost/2?receiver-name=2
2022-07-29T06:47:33.989166+0200 test-kyc-api-101717 INFO user42_payto: payto://x-taler-bank/localhost/42?receiver-name=42
2022-07-29T06:47:33.989176+0200 test-kyc-api-101717 INFO user43_payto: payto://x-taler-bank/localhost/43?receiver-name=43
psql:/home/ttn/te/share/taler/sql/exchange/drop.sql:23: ERROR:  schema "exchange" does not exist
2022-07-29T06:47:34.036011+0200 taler-exchange-dbinit-101731 WARNING Could not run PSQL on file /home/ttn/te/share/taler//sql/exchange/drop.sql: psql exit code was 3
2022-07-29T06:47:34.036162+0200 taler-exchange-dbinit-101731 ERROR Could not drop tables as requested. Either database was not yet initialized, or permission denied. Consult the logs. Will still try to create new tables.
psql:/home/ttn/te/share/taler/sql/exchange/procedures.sql:246: ERROR:  no schema has been selected to create in
2022-07-29T06:47:34.056606+0200 taler-exchange-dbinit-101731 WARNING Could not run PSQL on file /home/ttn/te/share/taler//sql/exchange/procedures.sql: psql exit code was 3
Failed to initialize database.
2022-07-29T06:47:34.057877+0200 test-kyc-api-101717 ERROR Failed to setup (exchange) database, exit code 4
SKIP test_kyc_api (exit status: 77)

SKIP: test_taler_exchange_aggregator-postgres
=============================================

psql:/home/ttn/te/share/taler/sql/exchange/drop.sql:23: ERROR:  schema "exchange" does not exist
2022-07-29T06:47:34.124208+0200 taler-exchange-dbinit-101757 WARNING Could not run PSQL on file /home/ttn/te/share/taler//sql/exchange/drop.sql: psql exit code was 3
2022-07-29T06:47:34.124338+0200 taler-exchange-dbinit-101757 ERROR Could not drop tables as requested. Either database was not yet initialized, or permission denied. Consult the logs. Will still try to create new tables.
psql:/home/ttn/te/share/taler/sql/exchange/procedures.sql:246: ERROR:  no schema has been selected to create in
2022-07-29T06:47:34.140606+0200 taler-exchange-dbinit-101757 WARNING Could not run PSQL on file /home/ttn/te/share/taler//sql/exchange/procedures.sql: psql exit code was 3
Failed to initialize database.
2022-07-29T06:47:34.141876+0200 test_taler_exchange_aggregator-101743 ERROR Failed to setup (exchange) database, exit code 4
2022-07-29T06:47:34.141987+0200 test_taler_exchange_aggregator-101743 WARNING Could not prepare the exchange.
SKIP test_taler_exchange_aggregator-postgres (exit status: 77)

SKIP: test_taler_exchange_wirewatch-postgres
============================================

2022-07-29T06:47:34.175405+0200 test_taler_exchange_wirewatch-101769 INFO Change in PQ event FD to -1
2022-07-29T06:47:34.175501+0200 test_taler_exchange_wirewatch-101769 INFO New poll FD is -1
2022-07-29T06:47:34.180072+0200 test_taler_exchange_wirewatch-101769 INFO Change in PQ event FD to 4
2022-07-29T06:47:34.180104+0200 test_taler_exchange_wirewatch-101769 INFO New poll FD is 4
psql:/home/ttn/te/share/taler/sql/exchange/drop.sql:23: ERROR:  schema "exchange" does not exist
2022-07-29T06:47:34.219989+0200 taler-exchange-dbinit-101784 WARNING Could not run PSQL on file /home/ttn/te/share/taler//sql/exchange/drop.sql: psql exit code was 3
2022-07-29T06:47:34.220111+0200 taler-exchange-dbinit-101784 ERROR Could not drop tables as requested. Either database was not yet initialized, or permission denied. Consult the logs. Will still try to create new tables.
psql:/home/ttn/te/share/taler/sql/exchange/procedures.sql:246: ERROR:  no schema has been selected to create in
2022-07-29T06:47:34.238630+0200 taler-exchange-dbinit-101784 WARNING Could not run PSQL on file /home/ttn/te/share/taler//sql/exchange/procedures.sql: psql exit code was 3
Failed to initialize database.
2022-07-29T06:47:34.239940+0200 test_taler_exchange_wirewatch-101769 ERROR Failed to setup (exchange) database, exit code 4
2022-07-29T06:47:34.239983+0200 test_taler_exchange_wirewatch-101769 INFO Could not prepare the exchange
SKIP test_taler_exchange_wirewatch-postgres (exit status: 77)

FAIL: test_exchange_p2p_cs
==========================

2022-07-29T06:47:34.269165+0200 /home/ttn/build/GNU/T/exchange/src/testing/.libs/test_exchange_p2p_cs-101796 INFO Using fakebank http://localhost:9081/2/ on port 9081
2022-07-29T06:47:34.269440+0200 /home/ttn/build/GNU/T/exchange/src/testing/.libs/test_exchange_p2p_cs-101796 INFO exchange payto: payto://x-taler-bank/localhost/2?receiver-name=2
2022-07-29T06:47:34.269509+0200 /home/ttn/build/GNU/T/exchange/src/testing/.libs/test_exchange_p2p_cs-101796 INFO user42_payto: payto://x-taler-bank/localhost/42?receiver-name=42
2022-07-29T06:47:34.269522+0200 /home/ttn/build/GNU/T/exchange/src/testing/.libs/test_exchange_p2p_cs-101796 INFO user43_payto: payto://x-taler-bank/localhost/43?receiver-name=43
psql:/home/ttn/te/share/taler/sql/exchange/drop.sql:23: ERROR:  schema "exchange" does not exist
2022-07-29T06:47:34.318974+0200 taler-exchange-dbinit-101810 WARNING Could not run PSQL on file /home/ttn/te/share/taler//sql/exchange/drop.sql: psql exit code was 3
2022-07-29T06:47:34.319144+0200 taler-exchange-dbinit-101810 ERROR Could not drop tables as requested. Either database was not yet initialized, or permission denied. Consult the logs. Will still try to create new tables.
psql:/home/ttn/te/share/taler/sql/exchange/procedures.sql:246: ERROR:  no schema has been selected to create in
2022-07-29T06:47:34.336691+0200 taler-exchange-dbinit-101810 WARNING Could not run PSQL on file /home/ttn/te/share/taler//sql/exchange/procedures.sql: psql exit code was 3
Failed to initialize database.
2022-07-29T06:47:34.337900+0200 /home/ttn/build/GNU/T/exchange/src/testing/.libs/test_exchange_p2p_cs-101796 ERROR Failed to setup (exchange) database, exit code 4
FAIL test_exchange_p2p_cs (exit status: 78)

FAIL: test_exchange_p2p_rsa
===========================

2022-07-29T06:47:34.369780+0200 /home/ttn/build/GNU/T/exchange/src/testing/.libs/test_exchange_p2p_rsa-101822 INFO Using fakebank http://localhost:9081/2/ on port 9081
2022-07-29T06:47:34.370121+0200 /home/ttn/build/GNU/T/exchange/src/testing/.libs/test_exchange_p2p_rsa-101822 INFO exchange payto: payto://x-taler-bank/localhost/2?receiver-name=2
2022-07-29T06:47:34.370142+0200 /home/ttn/build/GNU/T/exchange/src/testing/.libs/test_exchange_p2p_rsa-101822 INFO user42_payto: payto://x-taler-bank/localhost/42?receiver-name=42
2022-07-29T06:47:34.370156+0200 /home/ttn/build/GNU/T/exchange/src/testing/.libs/test_exchange_p2p_rsa-101822 INFO user43_payto: payto://x-taler-bank/localhost/43?receiver-name=43
psql:/home/ttn/te/share/taler/sql/exchange/drop.sql:23: ERROR:  schema "exchange" does not exist
2022-07-29T06:47:34.408042+0200 taler-exchange-dbinit-101836 WARNING Could not run PSQL on file /home/ttn/te/share/taler//sql/exchange/drop.sql: psql exit code was 3
2022-07-29T06:47:34.408169+0200 taler-exchange-dbinit-101836 ERROR Could not drop tables as requested. Either database was not yet initialized, or permission denied. Consult the logs. Will still try to create new tables.
psql:/home/ttn/te/share/taler/sql/exchange/procedures.sql:246: ERROR:  no schema has been selected to create in
2022-07-29T06:47:34.426648+0200 taler-exchange-dbinit-101836 WARNING Could not run PSQL on file /home/ttn/te/share/taler//sql/exchange/procedures.sql: psql exit code was 3
Failed to initialize database.
2022-07-29T06:47:34.427835+0200 /home/ttn/build/GNU/T/exchange/src/testing/.libs/test_exchange_p2p_rsa-101822 ERROR Failed to setup (exchange) database, exit code 4
FAIL test_exchange_p2p_rsa (exit status: 78)

test-suite.log (28,061 bytes)   

ttn

2022-07-29 20:18

developer   ~0018974

Still fails for HEAD == ba0ab58cdd4bd767f3944dcde1dc16676220d136.

ttn

2022-07-31 16:34

developer   ~0018977

Still fails for HEAD == af6a9a95469f98172c53ca10167210d41803bfb9.

ttn

2022-08-01 00:16

developer   ~0018978

Still fails for HEAD == 31bfe5234e9f1031306ce7cfae9a8a3fee5aa304.

ttn

2022-08-01 12:16

developer   ~0018979

Still fails for HEAD == 7698f14d50373cbecc3a98e57875de0b0fc95618.

ttn

2022-08-02 16:25

developer   ~0018981

Still fails for HEAD == 266068c96cbe64d84da2c79fc6db56e8c56ba6b5.

Christian Grothoff

2022-08-06 22:27

manager   ~0018989

Should be fixed now.

ttn

2022-08-07 19:35

developer   ~0018997

Unfortunately, still fails for HEAD == 6e831da22a88216574f1150d5d0c2f846a642a80.
Updated logs attached.
(It looks like there are 6 FAILs in total for that directory, now.)
.ttn.exchange-make-check-2.log (18,319 bytes)   
+ export PATH=/home/ttn/te/bin:/home/ttn/build/GNU/T/hack:/usr/lib/postgresql/13/bin:/home/ttn/bin:/usr/local/bin:/usr/bin:/bin:/usr/local/games:/usr/games
+ PATH=/home/ttn/te/bin:/home/ttn/build/GNU/T/hack:/usr/lib/postgresql/13/bin:/home/ttn/bin:/usr/local/bin:/usr/bin:/bin:/usr/local/games:/usr/games
+ export TMPDIR=/home/ttn/te/tmp
+ TMPDIR=/home/ttn/te/tmp
+ export PGHOST=/home/ttn/te/pg
+ PGHOST=/home/ttn/te/pg
+ make check
Makefile:961: warning: overriding recipe for target 'doxygen-doc/taler-exchange.tag'
Makefile:956: warning: ignoring old recipe for target 'doxygen-doc/taler-exchange.tag'
Makefile:966: warning: overriding recipe for target 'doxygen-doc/taler-exchange.tag'
Makefile:961: warning: ignoring old recipe for target 'doxygen-doc/taler-exchange.tag'
Makefile:971: warning: overriding recipe for target 'doxygen-doc/taler-exchange.tag'
Makefile:966: warning: ignoring old recipe for target 'doxygen-doc/taler-exchange.tag'
Making check in .
make[1]: Entering directory '/home/ttn/build/GNU/T/exchange'
Makefile:961: warning: overriding recipe for target 'doxygen-doc/taler-exchange.tag'
Makefile:956: warning: ignoring old recipe for target 'doxygen-doc/taler-exchange.tag'
Makefile:966: warning: overriding recipe for target 'doxygen-doc/taler-exchange.tag'
Makefile:961: warning: ignoring old recipe for target 'doxygen-doc/taler-exchange.tag'
Makefile:971: warning: overriding recipe for target 'doxygen-doc/taler-exchange.tag'
Makefile:966: warning: ignoring old recipe for target 'doxygen-doc/taler-exchange.tag'
make[1]: Leaving directory '/home/ttn/build/GNU/T/exchange'
Making check in contrib
make[1]: Entering directory '/home/ttn/build/GNU/T/exchange/contrib'
Making check in .
make[2]: Entering directory '/home/ttn/build/GNU/T/exchange/contrib'
make[2]: Nothing to be done for 'check-am'.
make[2]: Leaving directory '/home/ttn/build/GNU/T/exchange/contrib'
make[1]: Leaving directory '/home/ttn/build/GNU/T/exchange/contrib'
Making check in src
make[1]: Entering directory '/home/ttn/build/GNU/T/exchange/src'
Making check in include
make[2]: Entering directory '/home/ttn/build/GNU/T/exchange/src/include'
make[2]: Nothing to be done for 'check'.
make[2]: Leaving directory '/home/ttn/build/GNU/T/exchange/src/include'
Making check in util
make[2]: Entering directory '/home/ttn/build/GNU/T/exchange/src/util'
make  test_age_restriction test_amount test_crypto test_helper_eddsa test_helper_rsa test_helper_cs test_payto test_url
make[3]: Entering directory '/home/ttn/build/GNU/T/exchange/src/util'
  CC       test_age_restriction.o
  CCLD     test_age_restriction
  CC       test_amount.o
  CCLD     test_amount
  CC       test_crypto.o
  CCLD     test_crypto
  CC       test_helper_eddsa.o
  CCLD     test_helper_eddsa
  CC       test_helper_rsa.o
  CCLD     test_helper_rsa
  CC       test_helper_cs.o
  CCLD     test_helper_cs
  CC       test_payto.o
  CCLD     test_payto
  CC       test_url.o
  CCLD     test_url
make[3]: Leaving directory '/home/ttn/build/GNU/T/exchange/src/util'
make  check-TESTS
make[3]: Entering directory '/home/ttn/build/GNU/T/exchange/src/util'
make[4]: Entering directory '/home/ttn/build/GNU/T/exchange/src/util'
PASS: test_age_restriction
PASS: test_amount
PASS: test_crypto
PASS: test_helper_eddsa
PASS: test_helper_rsa
PASS: test_helper_cs
PASS: test_payto
PASS: test_url
============================================================================
Testsuite summary for taler-exchange 0.8.5
============================================================================
# TOTAL: 8
# PASS:  8
# SKIP:  0
# XFAIL: 0
# FAIL:  0
# XPASS: 0
# ERROR: 0
============================================================================
make[4]: Leaving directory '/home/ttn/build/GNU/T/exchange/src/util'
make[3]: Leaving directory '/home/ttn/build/GNU/T/exchange/src/util'
make[2]: Leaving directory '/home/ttn/build/GNU/T/exchange/src/util'
Making check in json
make[2]: Entering directory '/home/ttn/build/GNU/T/exchange/src/json'
make  test_json test_json_wire
make[3]: Entering directory '/home/ttn/build/GNU/T/exchange/src/json'
  CC       test_json.o
  CCLD     test_json
  CC       test_json_wire.o
  CCLD     test_json_wire
make[3]: Leaving directory '/home/ttn/build/GNU/T/exchange/src/json'
make  check-TESTS
make[3]: Entering directory '/home/ttn/build/GNU/T/exchange/src/json'
make[4]: Entering directory '/home/ttn/build/GNU/T/exchange/src/json'
PASS: test_json
PASS: test_json_wire
============================================================================
Testsuite summary for taler-exchange 0.8.5
============================================================================
# TOTAL: 2
# PASS:  2
# SKIP:  0
# XFAIL: 0
# FAIL:  0
# XPASS: 0
# ERROR: 0
============================================================================
make[4]: Leaving directory '/home/ttn/build/GNU/T/exchange/src/json'
make[3]: Leaving directory '/home/ttn/build/GNU/T/exchange/src/json'
make[2]: Leaving directory '/home/ttn/build/GNU/T/exchange/src/json'
Making check in extensions
make[2]: Entering directory '/home/ttn/build/GNU/T/exchange/src/extensions'
make[2]: Nothing to be done for 'check'.
make[2]: Leaving directory '/home/ttn/build/GNU/T/exchange/src/extensions'
Making check in curl
make[2]: Entering directory '/home/ttn/build/GNU/T/exchange/src/curl'
make[2]: Nothing to be done for 'check'.
make[2]: Leaving directory '/home/ttn/build/GNU/T/exchange/src/curl'
Making check in pq
make[2]: Entering directory '/home/ttn/build/GNU/T/exchange/src/pq'
make  test_pq
make[3]: Entering directory '/home/ttn/build/GNU/T/exchange/src/pq'
  CC       test_pq.o
  CCLD     test_pq
make[3]: Leaving directory '/home/ttn/build/GNU/T/exchange/src/pq'
make  check-TESTS
make[3]: Entering directory '/home/ttn/build/GNU/T/exchange/src/pq'
make[4]: Entering directory '/home/ttn/build/GNU/T/exchange/src/pq'
PASS: test_pq
============================================================================
Testsuite summary for taler-exchange 0.8.5
============================================================================
# TOTAL: 1
# PASS:  1
# SKIP:  0
# XFAIL: 0
# FAIL:  0
# XPASS: 0
# ERROR: 0
============================================================================
make[4]: Leaving directory '/home/ttn/build/GNU/T/exchange/src/pq'
make[3]: Leaving directory '/home/ttn/build/GNU/T/exchange/src/pq'
make[2]: Leaving directory '/home/ttn/build/GNU/T/exchange/src/pq'
Making check in sq
make[2]: Entering directory '/home/ttn/build/GNU/T/exchange/src/sq'
make  test_sq
make[3]: Entering directory '/home/ttn/build/GNU/T/exchange/src/sq'
  CC       test_sq.o
  CCLD     test_sq
make[3]: Leaving directory '/home/ttn/build/GNU/T/exchange/src/sq'
make  check-TESTS
make[3]: Entering directory '/home/ttn/build/GNU/T/exchange/src/sq'
make[4]: Entering directory '/home/ttn/build/GNU/T/exchange/src/sq'
PASS: test_sq
============================================================================
Testsuite summary for taler-exchange 0.8.5
============================================================================
# TOTAL: 1
# PASS:  1
# SKIP:  0
# XFAIL: 0
# FAIL:  0
# XPASS: 0
# ERROR: 0
============================================================================
make[4]: Leaving directory '/home/ttn/build/GNU/T/exchange/src/sq'
make[3]: Leaving directory '/home/ttn/build/GNU/T/exchange/src/sq'
make[2]: Leaving directory '/home/ttn/build/GNU/T/exchange/src/sq'
Making check in mhd
make[2]: Entering directory '/home/ttn/build/GNU/T/exchange/src/mhd'
make[2]: Nothing to be done for 'check'.
make[2]: Leaving directory '/home/ttn/build/GNU/T/exchange/src/mhd'
Making check in bank-lib
make[2]: Entering directory '/home/ttn/build/GNU/T/exchange/src/bank-lib'
make  test_bank.sh
make[3]: Entering directory '/home/ttn/build/GNU/T/exchange/src/bank-lib'
make[3]: Nothing to be done for 'test_bank.sh'.
make[3]: Leaving directory '/home/ttn/build/GNU/T/exchange/src/bank-lib'
make  check-TESTS
make[3]: Entering directory '/home/ttn/build/GNU/T/exchange/src/bank-lib'
make[4]: Entering directory '/home/ttn/build/GNU/T/exchange/src/bank-lib'
PASS: test_bank.sh
============================================================================
Testsuite summary for taler-exchange 0.8.5
============================================================================
# TOTAL: 1
# PASS:  1
# SKIP:  0
# XFAIL: 0
# FAIL:  0
# XPASS: 0
# ERROR: 0
============================================================================
make[4]: Leaving directory '/home/ttn/build/GNU/T/exchange/src/bank-lib'
make[3]: Leaving directory '/home/ttn/build/GNU/T/exchange/src/bank-lib'
make[2]: Leaving directory '/home/ttn/build/GNU/T/exchange/src/bank-lib'
Making check in exchangedb
make[2]: Entering directory '/home/ttn/build/GNU/T/exchange/src/exchangedb'
make  check-am
make[3]: Entering directory '/home/ttn/build/GNU/T/exchange/src/exchangedb'
make  test-exchangedb-postgres bench-db-postgres
make[4]: Entering directory '/home/ttn/build/GNU/T/exchange/src/exchangedb'
  CC       test_exchangedb.o
  CCLD     test-exchangedb-postgres
  CC       bench_db.o
  CCLD     bench-db-postgres
make[4]: Leaving directory '/home/ttn/build/GNU/T/exchange/src/exchangedb'
make  check-TESTS
make[4]: Entering directory '/home/ttn/build/GNU/T/exchange/src/exchangedb'
make[5]: Entering directory '/home/ttn/build/GNU/T/exchange/src/exchangedb'
SKIP: test-exchangedb-postgres
============================================================================
Testsuite summary for taler-exchange 0.8.5
============================================================================
# TOTAL: 1
# PASS:  0
# SKIP:  1
# XFAIL: 0
# FAIL:  0
# XPASS: 0
# ERROR: 0
============================================================================
make[5]: Leaving directory '/home/ttn/build/GNU/T/exchange/src/exchangedb'
make[4]: Leaving directory '/home/ttn/build/GNU/T/exchange/src/exchangedb'
make[3]: Leaving directory '/home/ttn/build/GNU/T/exchange/src/exchangedb'
make[2]: Leaving directory '/home/ttn/build/GNU/T/exchange/src/exchangedb'
Making check in kyclogic
make[2]: Entering directory '/home/ttn/build/GNU/T/exchange/src/kyclogic'
make[2]: Nothing to be done for 'check'.
make[2]: Leaving directory '/home/ttn/build/GNU/T/exchange/src/kyclogic'
Making check in exchange
make[2]: Entering directory '/home/ttn/build/GNU/T/exchange/src/exchange'
make  test_taler_exchange_httpd.sh 
make[3]: Entering directory '/home/ttn/build/GNU/T/exchange/src/exchange'
make[3]: Nothing to be done for 'test_taler_exchange_httpd.sh'.
make[3]: Leaving directory '/home/ttn/build/GNU/T/exchange/src/exchange'
make  check-TESTS
make[3]: Entering directory '/home/ttn/build/GNU/T/exchange/src/exchange'
make[4]: Entering directory '/home/ttn/build/GNU/T/exchange/src/exchange'
SKIP: test_taler_exchange_httpd.sh
============================================================================
Testsuite summary for taler-exchange 0.8.5
============================================================================
# TOTAL: 1
# PASS:  0
# SKIP:  1
# XFAIL: 0
# FAIL:  0
# XPASS: 0
# ERROR: 0
============================================================================
make[4]: Leaving directory '/home/ttn/build/GNU/T/exchange/src/exchange'
make[3]: Leaving directory '/home/ttn/build/GNU/T/exchange/src/exchange'
make[2]: Leaving directory '/home/ttn/build/GNU/T/exchange/src/exchange'
Making check in auditordb
make[2]: Entering directory '/home/ttn/build/GNU/T/exchange/src/auditordb'
make  test-auditordb-postgres
make[3]: Entering directory '/home/ttn/build/GNU/T/exchange/src/auditordb'
  CC       test_auditordb.o
  CCLD     test-auditordb-postgres
make[3]: Leaving directory '/home/ttn/build/GNU/T/exchange/src/auditordb'
make  check-TESTS
make[3]: Entering directory '/home/ttn/build/GNU/T/exchange/src/auditordb'
make[4]: Entering directory '/home/ttn/build/GNU/T/exchange/src/auditordb'
PASS: test-auditordb-postgres
============================================================================
Testsuite summary for taler-exchange 0.8.5
============================================================================
# TOTAL: 1
# PASS:  1
# SKIP:  0
# XFAIL: 0
# FAIL:  0
# XPASS: 0
# ERROR: 0
============================================================================
make[4]: Leaving directory '/home/ttn/build/GNU/T/exchange/src/auditordb'
make[3]: Leaving directory '/home/ttn/build/GNU/T/exchange/src/auditordb'
make[2]: Leaving directory '/home/ttn/build/GNU/T/exchange/src/auditordb'
Making check in auditor
make[2]: Entering directory '/home/ttn/build/GNU/T/exchange/src/auditor'
make  test-auditor.sh test-revocation.sh test-sync.sh
make[3]: Entering directory '/home/ttn/build/GNU/T/exchange/src/auditor'
make[3]: Nothing to be done for 'test-auditor.sh'.
make[3]: Nothing to be done for 'test-revocation.sh'.
make[3]: Nothing to be done for 'test-sync.sh'.
make[3]: Leaving directory '/home/ttn/build/GNU/T/exchange/src/auditor'
make  check-TESTS
make[3]: Entering directory '/home/ttn/build/GNU/T/exchange/src/auditor'
make[4]: Entering directory '/home/ttn/build/GNU/T/exchange/src/auditor'
SKIP: test-auditor.sh
SKIP: test-revocation.sh
PASS: test-sync.sh
============================================================================
Testsuite summary for taler-exchange 0.8.5
============================================================================
# TOTAL: 3
# PASS:  1
# SKIP:  2
# XFAIL: 0
# FAIL:  0
# XPASS: 0
# ERROR: 0
============================================================================
make[4]: Leaving directory '/home/ttn/build/GNU/T/exchange/src/auditor'
make[3]: Leaving directory '/home/ttn/build/GNU/T/exchange/src/auditor'
make[2]: Leaving directory '/home/ttn/build/GNU/T/exchange/src/auditor'
Making check in lib
make[2]: Entering directory '/home/ttn/build/GNU/T/exchange/src/lib'
make[2]: Nothing to be done for 'check'.
make[2]: Leaving directory '/home/ttn/build/GNU/T/exchange/src/lib'
Making check in exchange-tools
make[2]: Entering directory '/home/ttn/build/GNU/T/exchange/src/exchange-tools'
make[2]: Nothing to be done for 'check'.
make[2]: Leaving directory '/home/ttn/build/GNU/T/exchange/src/exchange-tools'
Making check in testing
make[2]: Entering directory '/home/ttn/build/GNU/T/exchange/src/testing'
make  test_auditor_api_cs test_auditor_api_rsa test_auditor_api_version_rsa test_auditor_api_version_cs test_bank_api_with_fakebank test_bank_api_with_nexus test_exchange_api_cs test_exchange_api_rsa test_exchange_api_keys_cherry_picking_cs test_exchange_api_keys_cherry_picking_rsa test_exchange_api_revocation_cs test_exchange_api_revocation_rsa test_exchange_api_overlapping_keys_bug_cs test_exchange_api_overlapping_keys_bug_rsa test_exchange_management_api_cs test_exchange_management_api_rsa test_kyc_api test_taler_exchange_aggregator-postgres test_taler_exchange_wirewatch-postgres test_exchange_p2p_cs test_exchange_p2p_rsa 
make[3]: Entering directory '/home/ttn/build/GNU/T/exchange/src/testing'
  CC       test_auditor_api.o
  CCLD     test_auditor_api_cs
  CCLD     test_auditor_api_rsa
  CC       test_auditor_api_version.o
  CCLD     test_auditor_api_version_rsa
  CCLD     test_auditor_api_version_cs
  CC       test_bank_api.o
  CCLD     test_bank_api_with_fakebank
  CCLD     test_bank_api_with_nexus
  CC       test_exchange_api.o
  CCLD     test_exchange_api_cs
  CCLD     test_exchange_api_rsa
  CC       test_exchange_api_keys_cherry_picking.o
  CCLD     test_exchange_api_keys_cherry_picking_cs
  CCLD     test_exchange_api_keys_cherry_picking_rsa
  CC       test_exchange_api_revocation.o
  CCLD     test_exchange_api_revocation_cs
  CCLD     test_exchange_api_revocation_rsa
  CC       test_exchange_api_overlapping_keys_bug.o
  CCLD     test_exchange_api_overlapping_keys_bug_cs
  CCLD     test_exchange_api_overlapping_keys_bug_rsa
  CC       test_exchange_management_api.o
  CCLD     test_exchange_management_api_cs
  CCLD     test_exchange_management_api_rsa
  CC       test_kyc_api.o
  CCLD     test_kyc_api
  CC       test_taler_exchange_aggregator.o
  CCLD     test_taler_exchange_aggregator-postgres
  CC       test_taler_exchange_wirewatch.o
  CCLD     test_taler_exchange_wirewatch-postgres
  CC       test_exchange_p2p.o
  CCLD     test_exchange_p2p_cs
  CCLD     test_exchange_p2p_rsa
make[3]: Leaving directory '/home/ttn/build/GNU/T/exchange/src/testing'
make  check-TESTS
make[3]: Entering directory '/home/ttn/build/GNU/T/exchange/src/testing'
make[4]: Entering directory '/home/ttn/build/GNU/T/exchange/src/testing'
FAIL: test_auditor_api_cs
FAIL: test_auditor_api_rsa
PASS: test_auditor_api_version_rsa
PASS: test_auditor_api_version_cs
PASS: test_bank_api_with_fakebank
SKIP: test_bank_api_with_nexus
FAIL: test_exchange_api_cs
FAIL: test_exchange_api_rsa
SKIP: test_exchange_api_keys_cherry_picking_cs
SKIP: test_exchange_api_keys_cherry_picking_rsa
SKIP: test_exchange_api_revocation_cs
SKIP: test_exchange_api_revocation_rsa
SKIP: test_exchange_api_overlapping_keys_bug_cs
SKIP: test_exchange_api_overlapping_keys_bug_rsa
SKIP: test_exchange_management_api_cs
SKIP: test_exchange_management_api_rsa
SKIP: test_kyc_api
SKIP: test_taler_exchange_aggregator-postgres
SKIP: test_taler_exchange_wirewatch-postgres
FAIL: test_exchange_p2p_cs
FAIL: test_exchange_p2p_rsa
============================================================================
Testsuite summary for taler-exchange 0.8.5
============================================================================
# TOTAL: 21
# PASS:  3
# SKIP:  12
# XFAIL: 0
# FAIL:  6
# XPASS: 0
# ERROR: 0
============================================================================
See src/testing/test-suite.log
Please report to taler-bug@gnunet.org
============================================================================
make[4]: *** [Makefile:1979: test-suite.log] Error 1
make[4]: Leaving directory '/home/ttn/build/GNU/T/exchange/src/testing'
make[3]: *** [Makefile:2087: check-TESTS] Error 2
make[3]: Leaving directory '/home/ttn/build/GNU/T/exchange/src/testing'
make[2]: *** [Makefile:2322: check-am] Error 2
make[2]: Leaving directory '/home/ttn/build/GNU/T/exchange/src/testing'
make[1]: *** [Makefile:523: check-recursive] Error 1
make[1]: Leaving directory '/home/ttn/build/GNU/T/exchange/src'
make: *** [Makefile:507: check-recursive] Error 1
.ttn.exchange-make-check-2.log (18,319 bytes)   
test-suite-2.log (27,508 bytes)   
======================================================
   taler-exchange 0.8.5: src/testing/test-suite.log
======================================================

# TOTAL: 21
# PASS:  3
# SKIP:  12
# XFAIL: 0
# FAIL:  6
# XPASS: 0
# ERROR: 0

.. contents:: :depth: 2

FAIL: test_auditor_api_cs
=========================

2022-08-07T16:09:23.026355+0200 /home/ttn/build/GNU/T/exchange/src/testing/.libs/test_auditor_api_cs-557661 INFO Using fakebank http://localhost:8082/2/ on port 8082
2022-08-07T16:09:23.026632+0200 /home/ttn/build/GNU/T/exchange/src/testing/.libs/test_auditor_api_cs-557661 INFO exchange payto: payto://x-taler-bank/localhost/2?receiver-name=2
2022-08-07T16:09:23.026649+0200 /home/ttn/build/GNU/T/exchange/src/testing/.libs/test_auditor_api_cs-557661 INFO user42_payto: payto://x-taler-bank/localhost/42?receiver-name=42
2022-08-07T16:09:23.026659+0200 /home/ttn/build/GNU/T/exchange/src/testing/.libs/test_auditor_api_cs-557661 INFO user43_payto: payto://x-taler-bank/localhost/43?receiver-name=43
psql:/home/ttn/te/share/taler/sql/exchange/drop.sql:23: ERROR:  schema "exchange" does not exist
2022-08-07T16:09:23.075057+0200 taler-exchange-dbinit-557675 WARNING Could not run PSQL on file /home/ttn/te/share/taler//sql/exchange/drop.sql: psql exit code was 3
2022-08-07T16:09:23.075194+0200 taler-exchange-dbinit-557675 ERROR Could not drop tables as requested. Either database was not yet initialized, or permission denied. Consult the logs. Will still try to create new tables.
psql:/home/ttn/te/share/taler/sql/exchange/procedures.sql:246: ERROR:  no schema has been selected to create in
2022-08-07T16:09:23.093010+0200 taler-exchange-dbinit-557675 WARNING Could not run PSQL on file /home/ttn/te/share/taler//sql/exchange/procedures.sql: psql exit code was 3
Failed to initialize database.
2022-08-07T16:09:23.094246+0200 /home/ttn/build/GNU/T/exchange/src/testing/.libs/test_auditor_api_cs-557661 ERROR Failed to setup (exchange) database, exit code 4
FAIL test_auditor_api_cs (exit status: 78)

FAIL: test_auditor_api_rsa
==========================

2022-08-07T16:09:23.123171+0200 /home/ttn/build/GNU/T/exchange/src/testing/.libs/test_auditor_api_rsa-557687 INFO Using fakebank http://localhost:8082/2/ on port 8082
2022-08-07T16:09:23.123550+0200 /home/ttn/build/GNU/T/exchange/src/testing/.libs/test_auditor_api_rsa-557687 INFO exchange payto: payto://x-taler-bank/localhost/2?receiver-name=2
2022-08-07T16:09:23.123574+0200 /home/ttn/build/GNU/T/exchange/src/testing/.libs/test_auditor_api_rsa-557687 INFO user42_payto: payto://x-taler-bank/localhost/42?receiver-name=42
2022-08-07T16:09:23.123593+0200 /home/ttn/build/GNU/T/exchange/src/testing/.libs/test_auditor_api_rsa-557687 INFO user43_payto: payto://x-taler-bank/localhost/43?receiver-name=43
psql:/home/ttn/te/share/taler/sql/exchange/drop.sql:23: ERROR:  schema "exchange" does not exist
2022-08-07T16:09:23.172299+0200 taler-exchange-dbinit-557701 WARNING Could not run PSQL on file /home/ttn/te/share/taler//sql/exchange/drop.sql: psql exit code was 3
2022-08-07T16:09:23.172438+0200 taler-exchange-dbinit-557701 ERROR Could not drop tables as requested. Either database was not yet initialized, or permission denied. Consult the logs. Will still try to create new tables.
psql:/home/ttn/te/share/taler/sql/exchange/procedures.sql:246: ERROR:  no schema has been selected to create in
2022-08-07T16:09:23.191529+0200 taler-exchange-dbinit-557701 WARNING Could not run PSQL on file /home/ttn/te/share/taler//sql/exchange/procedures.sql: psql exit code was 3
Failed to initialize database.
2022-08-07T16:09:23.192794+0200 /home/ttn/build/GNU/T/exchange/src/testing/.libs/test_auditor_api_rsa-557687 ERROR Failed to setup (exchange) database, exit code 4
FAIL test_auditor_api_rsa (exit status: 78)

SKIP: test_bank_api_with_nexus
==============================

rm: cannot remove '/tmp/libeufin-exchange-test.sqlite3': Operation not permitted
2022-08-07T16:09:52.499942+0200 test-bank-api-558452 ERROR Failed to invoke db-removal command.
2022-08-07T16:09:52.500011+0200 test-bank-api-558452 ERROR Assertion failed at test_bank_api.c:244.
SKIP test_bank_api_with_nexus (exit status: 77)

FAIL: test_exchange_api_cs
==========================

2022-08-07T16:09:52.531573+0200 /home/ttn/build/GNU/T/exchange/src/testing/.libs/test_exchange_api_cs-558472 INFO Using fakebank http://localhost:9081/2/ on port 9081
2022-08-07T16:09:52.531938+0200 /home/ttn/build/GNU/T/exchange/src/testing/.libs/test_exchange_api_cs-558472 INFO exchange payto: payto://x-taler-bank/localhost/2?receiver-name=2
2022-08-07T16:09:52.531957+0200 /home/ttn/build/GNU/T/exchange/src/testing/.libs/test_exchange_api_cs-558472 INFO user42_payto: payto://x-taler-bank/localhost/42?receiver-name=42
2022-08-07T16:09:52.531969+0200 /home/ttn/build/GNU/T/exchange/src/testing/.libs/test_exchange_api_cs-558472 INFO user43_payto: payto://x-taler-bank/localhost/43?receiver-name=43
psql:/home/ttn/te/share/taler/sql/exchange/drop.sql:23: ERROR:  schema "exchange" does not exist
2022-08-07T16:09:52.578873+0200 taler-exchange-dbinit-558486 WARNING Could not run PSQL on file /home/ttn/te/share/taler//sql/exchange/drop.sql: psql exit code was 3
2022-08-07T16:09:52.579065+0200 taler-exchange-dbinit-558486 ERROR Could not drop tables as requested. Either database was not yet initialized, or permission denied. Consult the logs. Will still try to create new tables.
psql:/home/ttn/te/share/taler/sql/exchange/procedures.sql:246: ERROR:  no schema has been selected to create in
2022-08-07T16:09:52.600781+0200 taler-exchange-dbinit-558486 WARNING Could not run PSQL on file /home/ttn/te/share/taler//sql/exchange/procedures.sql: psql exit code was 3
Failed to initialize database.
2022-08-07T16:09:52.602132+0200 /home/ttn/build/GNU/T/exchange/src/testing/.libs/test_exchange_api_cs-558472 ERROR Failed to setup (exchange) database, exit code 4
FAIL test_exchange_api_cs (exit status: 78)

FAIL: test_exchange_api_rsa
===========================

2022-08-07T16:09:52.635340+0200 /home/ttn/build/GNU/T/exchange/src/testing/.libs/test_exchange_api_rsa-558498 INFO Using fakebank http://localhost:9081/2/ on port 9081
2022-08-07T16:09:52.635660+0200 /home/ttn/build/GNU/T/exchange/src/testing/.libs/test_exchange_api_rsa-558498 INFO exchange payto: payto://x-taler-bank/localhost/2?receiver-name=2
2022-08-07T16:09:52.635679+0200 /home/ttn/build/GNU/T/exchange/src/testing/.libs/test_exchange_api_rsa-558498 INFO user42_payto: payto://x-taler-bank/localhost/42?receiver-name=42
2022-08-07T16:09:52.635691+0200 /home/ttn/build/GNU/T/exchange/src/testing/.libs/test_exchange_api_rsa-558498 INFO user43_payto: payto://x-taler-bank/localhost/43?receiver-name=43
psql:/home/ttn/te/share/taler/sql/exchange/drop.sql:23: ERROR:  schema "exchange" does not exist
2022-08-07T16:09:52.682779+0200 taler-exchange-dbinit-558512 WARNING Could not run PSQL on file /home/ttn/te/share/taler//sql/exchange/drop.sql: psql exit code was 3
2022-08-07T16:09:52.682960+0200 taler-exchange-dbinit-558512 ERROR Could not drop tables as requested. Either database was not yet initialized, or permission denied. Consult the logs. Will still try to create new tables.
psql:/home/ttn/te/share/taler/sql/exchange/procedures.sql:246: ERROR:  no schema has been selected to create in
2022-08-07T16:09:52.701686+0200 taler-exchange-dbinit-558512 WARNING Could not run PSQL on file /home/ttn/te/share/taler//sql/exchange/procedures.sql: psql exit code was 3
Failed to initialize database.
2022-08-07T16:09:52.702886+0200 /home/ttn/build/GNU/T/exchange/src/testing/.libs/test_exchange_api_rsa-558498 ERROR Failed to setup (exchange) database, exit code 4
FAIL test_exchange_api_rsa (exit status: 78)

SKIP: test_exchange_api_keys_cherry_picking_cs
==============================================

psql:/home/ttn/te/share/taler/sql/exchange/drop.sql:23: ERROR:  schema "exchange" does not exist
2022-08-07T16:09:52.770914+0200 taler-exchange-dbinit-558538 WARNING Could not run PSQL on file /home/ttn/te/share/taler//sql/exchange/drop.sql: psql exit code was 3
2022-08-07T16:09:52.771055+0200 taler-exchange-dbinit-558538 ERROR Could not drop tables as requested. Either database was not yet initialized, or permission denied. Consult the logs. Will still try to create new tables.
psql:/home/ttn/te/share/taler/sql/exchange/procedures.sql:246: ERROR:  no schema has been selected to create in
2022-08-07T16:09:52.789340+0200 taler-exchange-dbinit-558538 WARNING Could not run PSQL on file /home/ttn/te/share/taler//sql/exchange/procedures.sql: psql exit code was 3
Failed to initialize database.
2022-08-07T16:09:52.790499+0200 /home/ttn/build/GNU/T/exchange/src/testing/.libs/test_exchange_api_keys_cherry_picking_cs-558524 ERROR Failed to setup (exchange) database, exit code 4
SKIP test_exchange_api_keys_cherry_picking_cs (exit status: 77)

SKIP: test_exchange_api_keys_cherry_picking_rsa
===============================================

psql:/home/ttn/te/share/taler/sql/exchange/drop.sql:23: ERROR:  schema "exchange" does not exist
2022-08-07T16:09:52.863265+0200 taler-exchange-dbinit-558564 WARNING Could not run PSQL on file /home/ttn/te/share/taler//sql/exchange/drop.sql: psql exit code was 3
2022-08-07T16:09:52.863405+0200 taler-exchange-dbinit-558564 ERROR Could not drop tables as requested. Either database was not yet initialized, or permission denied. Consult the logs. Will still try to create new tables.
psql:/home/ttn/te/share/taler/sql/exchange/procedures.sql:246: ERROR:  no schema has been selected to create in
2022-08-07T16:09:52.882300+0200 taler-exchange-dbinit-558564 WARNING Could not run PSQL on file /home/ttn/te/share/taler//sql/exchange/procedures.sql: psql exit code was 3
Failed to initialize database.
2022-08-07T16:09:52.883658+0200 /home/ttn/build/GNU/T/exchange/src/testing/.libs/test_exchange_api_keys_cherry_picking_rsa-558550 ERROR Failed to setup (exchange) database, exit code 4
SKIP test_exchange_api_keys_cherry_picking_rsa (exit status: 77)

SKIP: test_exchange_api_revocation_cs
=====================================

2022-08-07T16:09:52.915148+0200 /home/ttn/build/GNU/T/exchange/src/testing/.libs/test_exchange_api_revocation_cs-558576 INFO Using fakebank http://localhost:9081/2/ on port 9081
2022-08-07T16:09:52.915424+0200 /home/ttn/build/GNU/T/exchange/src/testing/.libs/test_exchange_api_revocation_cs-558576 INFO exchange payto: payto://x-taler-bank/localhost/2?receiver-name=2
2022-08-07T16:09:52.915440+0200 /home/ttn/build/GNU/T/exchange/src/testing/.libs/test_exchange_api_revocation_cs-558576 INFO user42_payto: payto://x-taler-bank/localhost/42?receiver-name=42
2022-08-07T16:09:52.915450+0200 /home/ttn/build/GNU/T/exchange/src/testing/.libs/test_exchange_api_revocation_cs-558576 INFO user43_payto: payto://x-taler-bank/localhost/43?receiver-name=43
psql:/home/ttn/te/share/taler/sql/exchange/drop.sql:23: ERROR:  schema "exchange" does not exist
2022-08-07T16:09:52.960431+0200 taler-exchange-dbinit-558590 WARNING Could not run PSQL on file /home/ttn/te/share/taler//sql/exchange/drop.sql: psql exit code was 3
2022-08-07T16:09:52.960559+0200 taler-exchange-dbinit-558590 ERROR Could not drop tables as requested. Either database was not yet initialized, or permission denied. Consult the logs. Will still try to create new tables.
psql:/home/ttn/te/share/taler/sql/exchange/procedures.sql:246: ERROR:  no schema has been selected to create in
2022-08-07T16:09:52.980533+0200 taler-exchange-dbinit-558590 WARNING Could not run PSQL on file /home/ttn/te/share/taler//sql/exchange/procedures.sql: psql exit code was 3
Failed to initialize database.
2022-08-07T16:09:52.981760+0200 /home/ttn/build/GNU/T/exchange/src/testing/.libs/test_exchange_api_revocation_cs-558576 ERROR Failed to setup (exchange) database, exit code 4
SKIP test_exchange_api_revocation_cs (exit status: 77)

SKIP: test_exchange_api_revocation_rsa
======================================

2022-08-07T16:09:53.011548+0200 /home/ttn/build/GNU/T/exchange/src/testing/.libs/test_exchange_api_revocation_rsa-558602 INFO Using fakebank http://localhost:9081/2/ on port 9081
2022-08-07T16:09:53.011828+0200 /home/ttn/build/GNU/T/exchange/src/testing/.libs/test_exchange_api_revocation_rsa-558602 INFO exchange payto: payto://x-taler-bank/localhost/2?receiver-name=2
2022-08-07T16:09:53.011844+0200 /home/ttn/build/GNU/T/exchange/src/testing/.libs/test_exchange_api_revocation_rsa-558602 INFO user42_payto: payto://x-taler-bank/localhost/42?receiver-name=42
2022-08-07T16:09:53.011854+0200 /home/ttn/build/GNU/T/exchange/src/testing/.libs/test_exchange_api_revocation_rsa-558602 INFO user43_payto: payto://x-taler-bank/localhost/43?receiver-name=43
psql:/home/ttn/te/share/taler/sql/exchange/drop.sql:23: ERROR:  schema "exchange" does not exist
2022-08-07T16:09:53.052195+0200 taler-exchange-dbinit-558616 WARNING Could not run PSQL on file /home/ttn/te/share/taler//sql/exchange/drop.sql: psql exit code was 3
2022-08-07T16:09:53.052327+0200 taler-exchange-dbinit-558616 ERROR Could not drop tables as requested. Either database was not yet initialized, or permission denied. Consult the logs. Will still try to create new tables.
psql:/home/ttn/te/share/taler/sql/exchange/procedures.sql:246: ERROR:  no schema has been selected to create in
2022-08-07T16:09:53.069837+0200 taler-exchange-dbinit-558616 WARNING Could not run PSQL on file /home/ttn/te/share/taler//sql/exchange/procedures.sql: psql exit code was 3
Failed to initialize database.
2022-08-07T16:09:53.071238+0200 /home/ttn/build/GNU/T/exchange/src/testing/.libs/test_exchange_api_revocation_rsa-558602 ERROR Failed to setup (exchange) database, exit code 4
SKIP test_exchange_api_revocation_rsa (exit status: 77)

SKIP: test_exchange_api_overlapping_keys_bug_cs
===============================================

psql:/home/ttn/te/share/taler/sql/exchange/drop.sql:23: ERROR:  schema "exchange" does not exist
2022-08-07T16:09:53.135392+0200 taler-exchange-dbinit-558642 WARNING Could not run PSQL on file /home/ttn/te/share/taler//sql/exchange/drop.sql: psql exit code was 3
2022-08-07T16:09:53.135518+0200 taler-exchange-dbinit-558642 ERROR Could not drop tables as requested. Either database was not yet initialized, or permission denied. Consult the logs. Will still try to create new tables.
psql:/home/ttn/te/share/taler/sql/exchange/procedures.sql:246: ERROR:  no schema has been selected to create in
2022-08-07T16:09:53.152252+0200 taler-exchange-dbinit-558642 WARNING Could not run PSQL on file /home/ttn/te/share/taler//sql/exchange/procedures.sql: psql exit code was 3
Failed to initialize database.
2022-08-07T16:09:53.153402+0200 /home/ttn/build/GNU/T/exchange/src/testing/.libs/test_exchange_api_overlapping_keys_bug_cs-558628 ERROR Failed to setup (exchange) database, exit code 4
SKIP test_exchange_api_overlapping_keys_bug_cs (exit status: 77)

SKIP: test_exchange_api_overlapping_keys_bug_rsa
================================================

psql:/home/ttn/te/share/taler/sql/exchange/drop.sql:23: ERROR:  schema "exchange" does not exist
2022-08-07T16:09:53.224663+0200 taler-exchange-dbinit-558668 WARNING Could not run PSQL on file /home/ttn/te/share/taler//sql/exchange/drop.sql: psql exit code was 3
2022-08-07T16:09:53.224781+0200 taler-exchange-dbinit-558668 ERROR Could not drop tables as requested. Either database was not yet initialized, or permission denied. Consult the logs. Will still try to create new tables.
psql:/home/ttn/te/share/taler/sql/exchange/procedures.sql:246: ERROR:  no schema has been selected to create in
2022-08-07T16:09:53.240752+0200 taler-exchange-dbinit-558668 WARNING Could not run PSQL on file /home/ttn/te/share/taler//sql/exchange/procedures.sql: psql exit code was 3
Failed to initialize database.
2022-08-07T16:09:53.241999+0200 /home/ttn/build/GNU/T/exchange/src/testing/.libs/test_exchange_api_overlapping_keys_bug_rsa-558654 ERROR Failed to setup (exchange) database, exit code 4
SKIP test_exchange_api_overlapping_keys_bug_rsa (exit status: 77)

SKIP: test_exchange_management_api_cs
=====================================

2022-08-07T16:09:53.269161+0200 /home/ttn/build/GNU/T/exchange/src/testing/.libs/test_exchange_management_api_cs-558687 INFO Using fakebank http://localhost:9081/2/ on port 9081
2022-08-07T16:09:53.269433+0200 /home/ttn/build/GNU/T/exchange/src/testing/.libs/test_exchange_management_api_cs-558687 INFO exchange payto: payto://x-taler-bank/localhost/2?receiver-name=2
2022-08-07T16:09:53.269455+0200 /home/ttn/build/GNU/T/exchange/src/testing/.libs/test_exchange_management_api_cs-558687 INFO user42_payto: payto://x-taler-bank/localhost/42?receiver-name=42
2022-08-07T16:09:53.269466+0200 /home/ttn/build/GNU/T/exchange/src/testing/.libs/test_exchange_management_api_cs-558687 INFO user43_payto: payto://x-taler-bank/localhost/43?receiver-name=43
psql:/home/ttn/te/share/taler/sql/exchange/drop.sql:23: ERROR:  schema "exchange" does not exist
2022-08-07T16:09:53.311188+0200 taler-exchange-dbinit-558701 WARNING Could not run PSQL on file /home/ttn/te/share/taler//sql/exchange/drop.sql: psql exit code was 3
2022-08-07T16:09:53.311328+0200 taler-exchange-dbinit-558701 ERROR Could not drop tables as requested. Either database was not yet initialized, or permission denied. Consult the logs. Will still try to create new tables.
psql:/home/ttn/te/share/taler/sql/exchange/procedures.sql:246: ERROR:  no schema has been selected to create in
2022-08-07T16:09:53.329096+0200 taler-exchange-dbinit-558701 WARNING Could not run PSQL on file /home/ttn/te/share/taler//sql/exchange/procedures.sql: psql exit code was 3
Failed to initialize database.
2022-08-07T16:09:53.330447+0200 /home/ttn/build/GNU/T/exchange/src/testing/.libs/test_exchange_management_api_cs-558687 ERROR Failed to setup (exchange) database, exit code 4
SKIP test_exchange_management_api_cs (exit status: 77)

SKIP: test_exchange_management_api_rsa
======================================

2022-08-07T16:09:53.358348+0200 /home/ttn/build/GNU/T/exchange/src/testing/.libs/test_exchange_management_api_rsa-558713 INFO Using fakebank http://localhost:9081/2/ on port 9081
2022-08-07T16:09:53.358669+0200 /home/ttn/build/GNU/T/exchange/src/testing/.libs/test_exchange_management_api_rsa-558713 INFO exchange payto: payto://x-taler-bank/localhost/2?receiver-name=2
2022-08-07T16:09:53.358687+0200 /home/ttn/build/GNU/T/exchange/src/testing/.libs/test_exchange_management_api_rsa-558713 INFO user42_payto: payto://x-taler-bank/localhost/42?receiver-name=42
2022-08-07T16:09:53.358699+0200 /home/ttn/build/GNU/T/exchange/src/testing/.libs/test_exchange_management_api_rsa-558713 INFO user43_payto: payto://x-taler-bank/localhost/43?receiver-name=43
psql:/home/ttn/te/share/taler/sql/exchange/drop.sql:23: ERROR:  schema "exchange" does not exist
2022-08-07T16:09:53.400731+0200 taler-exchange-dbinit-558727 WARNING Could not run PSQL on file /home/ttn/te/share/taler//sql/exchange/drop.sql: psql exit code was 3
2022-08-07T16:09:53.400878+0200 taler-exchange-dbinit-558727 ERROR Could not drop tables as requested. Either database was not yet initialized, or permission denied. Consult the logs. Will still try to create new tables.
psql:/home/ttn/te/share/taler/sql/exchange/procedures.sql:246: ERROR:  no schema has been selected to create in
2022-08-07T16:09:53.417850+0200 taler-exchange-dbinit-558727 WARNING Could not run PSQL on file /home/ttn/te/share/taler//sql/exchange/procedures.sql: psql exit code was 3
Failed to initialize database.
2022-08-07T16:09:53.419019+0200 /home/ttn/build/GNU/T/exchange/src/testing/.libs/test_exchange_management_api_rsa-558713 ERROR Failed to setup (exchange) database, exit code 4
SKIP test_exchange_management_api_rsa (exit status: 77)

SKIP: test_kyc_api
==================

2022-08-07T16:09:53.448559+0200 test-kyc-api-558739 INFO Using fakebank http://localhost:8082/2/ on port 8082
2022-08-07T16:09:53.448857+0200 test-kyc-api-558739 INFO exchange payto: payto://x-taler-bank/localhost/2?receiver-name=2
2022-08-07T16:09:53.448875+0200 test-kyc-api-558739 INFO user42_payto: payto://x-taler-bank/localhost/42?receiver-name=42
2022-08-07T16:09:53.448886+0200 test-kyc-api-558739 INFO user43_payto: payto://x-taler-bank/localhost/43?receiver-name=43
psql:/home/ttn/te/share/taler/sql/exchange/drop.sql:23: ERROR:  schema "exchange" does not exist
2022-08-07T16:09:53.495567+0200 taler-exchange-dbinit-558754 WARNING Could not run PSQL on file /home/ttn/te/share/taler//sql/exchange/drop.sql: psql exit code was 3
2022-08-07T16:09:53.495720+0200 taler-exchange-dbinit-558754 ERROR Could not drop tables as requested. Either database was not yet initialized, or permission denied. Consult the logs. Will still try to create new tables.
psql:/home/ttn/te/share/taler/sql/exchange/procedures.sql:246: ERROR:  no schema has been selected to create in
2022-08-07T16:09:53.514043+0200 taler-exchange-dbinit-558754 WARNING Could not run PSQL on file /home/ttn/te/share/taler//sql/exchange/procedures.sql: psql exit code was 3
Failed to initialize database.
2022-08-07T16:09:53.515722+0200 test-kyc-api-558739 ERROR Failed to setup (exchange) database, exit code 4
SKIP test_kyc_api (exit status: 77)

SKIP: test_taler_exchange_aggregator-postgres
=============================================

psql:/home/ttn/te/share/taler/sql/exchange/drop.sql:23: ERROR:  schema "exchange" does not exist
2022-08-07T16:09:53.583093+0200 taler-exchange-dbinit-558816 WARNING Could not run PSQL on file /home/ttn/te/share/taler//sql/exchange/drop.sql: psql exit code was 3
2022-08-07T16:09:53.583220+0200 taler-exchange-dbinit-558816 ERROR Could not drop tables as requested. Either database was not yet initialized, or permission denied. Consult the logs. Will still try to create new tables.
psql:/home/ttn/te/share/taler/sql/exchange/procedures.sql:246: ERROR:  no schema has been selected to create in
2022-08-07T16:09:53.602189+0200 taler-exchange-dbinit-558816 WARNING Could not run PSQL on file /home/ttn/te/share/taler//sql/exchange/procedures.sql: psql exit code was 3
Failed to initialize database.
2022-08-07T16:09:53.603490+0200 test_taler_exchange_aggregator-558800 ERROR Failed to setup (exchange) database, exit code 4
2022-08-07T16:09:53.603605+0200 test_taler_exchange_aggregator-558800 WARNING Could not prepare the exchange.
SKIP test_taler_exchange_aggregator-postgres (exit status: 77)

SKIP: test_taler_exchange_wirewatch-postgres
============================================

2022-08-07T16:09:53.632359+0200 test_taler_exchange_wirewatch-558830 INFO Change in PQ event FD to -1
2022-08-07T16:09:53.632450+0200 test_taler_exchange_wirewatch-558830 INFO New poll FD is -1
2022-08-07T16:09:53.636165+0200 test_taler_exchange_wirewatch-558830 INFO Change in PQ event FD to 4
2022-08-07T16:09:53.636193+0200 test_taler_exchange_wirewatch-558830 INFO New poll FD is 4
psql:/home/ttn/te/share/taler/sql/exchange/drop.sql:23: ERROR:  schema "exchange" does not exist
2022-08-07T16:09:53.683888+0200 taler-exchange-dbinit-558845 WARNING Could not run PSQL on file /home/ttn/te/share/taler//sql/exchange/drop.sql: psql exit code was 3
2022-08-07T16:09:53.684015+0200 taler-exchange-dbinit-558845 ERROR Could not drop tables as requested. Either database was not yet initialized, or permission denied. Consult the logs. Will still try to create new tables.
psql:/home/ttn/te/share/taler/sql/exchange/procedures.sql:246: ERROR:  no schema has been selected to create in
2022-08-07T16:09:53.700854+0200 taler-exchange-dbinit-558845 WARNING Could not run PSQL on file /home/ttn/te/share/taler//sql/exchange/procedures.sql: psql exit code was 3
Failed to initialize database.
2022-08-07T16:09:53.702080+0200 test_taler_exchange_wirewatch-558830 ERROR Failed to setup (exchange) database, exit code 4
2022-08-07T16:09:53.702129+0200 test_taler_exchange_wirewatch-558830 INFO Could not prepare the exchange
SKIP test_taler_exchange_wirewatch-postgres (exit status: 77)

FAIL: test_exchange_p2p_cs
==========================

2022-08-07T16:09:53.730435+0200 /home/ttn/build/GNU/T/exchange/src/testing/.libs/test_exchange_p2p_cs-558857 INFO Using fakebank http://localhost:9081/2/ on port 9081
2022-08-07T16:09:53.730720+0200 /home/ttn/build/GNU/T/exchange/src/testing/.libs/test_exchange_p2p_cs-558857 INFO exchange payto: payto://x-taler-bank/localhost/2?receiver-name=2
2022-08-07T16:09:53.730737+0200 /home/ttn/build/GNU/T/exchange/src/testing/.libs/test_exchange_p2p_cs-558857 INFO user42_payto: payto://x-taler-bank/localhost/42?receiver-name=42
2022-08-07T16:09:53.730746+0200 /home/ttn/build/GNU/T/exchange/src/testing/.libs/test_exchange_p2p_cs-558857 INFO user43_payto: payto://x-taler-bank/localhost/43?receiver-name=43
psql:/home/ttn/te/share/taler/sql/exchange/drop.sql:23: ERROR:  schema "exchange" does not exist
2022-08-07T16:09:53.772876+0200 taler-exchange-dbinit-558873 WARNING Could not run PSQL on file /home/ttn/te/share/taler//sql/exchange/drop.sql: psql exit code was 3
2022-08-07T16:09:53.773003+0200 taler-exchange-dbinit-558873 ERROR Could not drop tables as requested. Either database was not yet initialized, or permission denied. Consult the logs. Will still try to create new tables.
psql:/home/ttn/te/share/taler/sql/exchange/procedures.sql:246: ERROR:  no schema has been selected to create in
2022-08-07T16:09:53.789539+0200 taler-exchange-dbinit-558873 WARNING Could not run PSQL on file /home/ttn/te/share/taler//sql/exchange/procedures.sql: psql exit code was 3
Failed to initialize database.
2022-08-07T16:09:53.790806+0200 /home/ttn/build/GNU/T/exchange/src/testing/.libs/test_exchange_p2p_cs-558857 ERROR Failed to setup (exchange) database, exit code 4
FAIL test_exchange_p2p_cs (exit status: 78)

FAIL: test_exchange_p2p_rsa
===========================

2022-08-07T16:09:53.820036+0200 /home/ttn/build/GNU/T/exchange/src/testing/.libs/test_exchange_p2p_rsa-558885 INFO Using fakebank http://localhost:9081/2/ on port 9081
2022-08-07T16:09:53.820318+0200 /home/ttn/build/GNU/T/exchange/src/testing/.libs/test_exchange_p2p_rsa-558885 INFO exchange payto: payto://x-taler-bank/localhost/2?receiver-name=2
2022-08-07T16:09:53.820335+0200 /home/ttn/build/GNU/T/exchange/src/testing/.libs/test_exchange_p2p_rsa-558885 INFO user42_payto: payto://x-taler-bank/localhost/42?receiver-name=42
2022-08-07T16:09:53.820345+0200 /home/ttn/build/GNU/T/exchange/src/testing/.libs/test_exchange_p2p_rsa-558885 INFO user43_payto: payto://x-taler-bank/localhost/43?receiver-name=43
psql:/home/ttn/te/share/taler/sql/exchange/drop.sql:23: ERROR:  schema "exchange" does not exist
2022-08-07T16:09:53.865977+0200 taler-exchange-dbinit-558899 WARNING Could not run PSQL on file /home/ttn/te/share/taler//sql/exchange/drop.sql: psql exit code was 3
2022-08-07T16:09:53.866113+0200 taler-exchange-dbinit-558899 ERROR Could not drop tables as requested. Either database was not yet initialized, or permission denied. Consult the logs. Will still try to create new tables.
psql:/home/ttn/te/share/taler/sql/exchange/procedures.sql:246: ERROR:  no schema has been selected to create in
2022-08-07T16:09:53.883408+0200 taler-exchange-dbinit-558899 WARNING Could not run PSQL on file /home/ttn/te/share/taler//sql/exchange/procedures.sql: psql exit code was 3
Failed to initialize database.
2022-08-07T16:09:53.884522+0200 /home/ttn/build/GNU/T/exchange/src/testing/.libs/test_exchange_p2p_rsa-558885 ERROR Failed to setup (exchange) database, exit code 4
FAIL test_exchange_p2p_rsa (exit status: 78)

test-suite-2.log (27,508 bytes)   

Christian Grothoff

2022-08-15 08:21

manager   ~0019006

That's strange. The schema is set to 'exchange' in the line:

SET search_path TO exchange;

of procedures.sql. I think you may have an outdated, unmigrated "talercheck" database.
Try
$ dropdb talercheck
$ createdb talercheck

ttn

2022-08-18 05:48

developer   ~0019018

In testing, there seems to be another problem that has recently crept in that prevents "make check" from even getting to the previous failure point.
It seems the new src/templating infrastructure wants to build "test_mustach_jansson", but that fails when trying to link it.
Logs attached.
.ttn.exchange-make-check-3.log (8,229 bytes)   
+ export PATH=/home/ttn/te/bin:/home/ttn/build/GNU/T/hack:/usr/lib/postgresql/13/bin:/home/ttn/bin:/usr/local/bin:/usr/bin:/bin:/usr/local/games:/usr/games
+ PATH=/home/ttn/te/bin:/home/ttn/build/GNU/T/hack:/usr/lib/postgresql/13/bin:/home/ttn/bin:/usr/local/bin:/usr/bin:/bin:/usr/local/games:/usr/games
+ export TMPDIR=/home/ttn/te/tmp
+ TMPDIR=/home/ttn/te/tmp
+ export PGHOST=/home/ttn/te/pg
+ PGHOST=/home/ttn/te/pg
+ make check
Makefile:961: warning: overriding recipe for target 'doxygen-doc/taler-exchange.tag'
Makefile:956: warning: ignoring old recipe for target 'doxygen-doc/taler-exchange.tag'
Makefile:966: warning: overriding recipe for target 'doxygen-doc/taler-exchange.tag'
Makefile:961: warning: ignoring old recipe for target 'doxygen-doc/taler-exchange.tag'
Makefile:971: warning: overriding recipe for target 'doxygen-doc/taler-exchange.tag'
Makefile:966: warning: ignoring old recipe for target 'doxygen-doc/taler-exchange.tag'
Making check in .
make[1]: Entering directory '/home/ttn/build/GNU/T/exchange'
Makefile:961: warning: overriding recipe for target 'doxygen-doc/taler-exchange.tag'
Makefile:956: warning: ignoring old recipe for target 'doxygen-doc/taler-exchange.tag'
Makefile:966: warning: overriding recipe for target 'doxygen-doc/taler-exchange.tag'
Makefile:961: warning: ignoring old recipe for target 'doxygen-doc/taler-exchange.tag'
Makefile:971: warning: overriding recipe for target 'doxygen-doc/taler-exchange.tag'
Makefile:966: warning: ignoring old recipe for target 'doxygen-doc/taler-exchange.tag'
make[1]: Leaving directory '/home/ttn/build/GNU/T/exchange'
Making check in contrib
make[1]: Entering directory '/home/ttn/build/GNU/T/exchange/contrib'
Making check in .
make[2]: Entering directory '/home/ttn/build/GNU/T/exchange/contrib'
make[2]: Nothing to be done for 'check-am'.
make[2]: Leaving directory '/home/ttn/build/GNU/T/exchange/contrib'
make[1]: Leaving directory '/home/ttn/build/GNU/T/exchange/contrib'
Making check in src
make[1]: Entering directory '/home/ttn/build/GNU/T/exchange/src'
Making check in include
make[2]: Entering directory '/home/ttn/build/GNU/T/exchange/src/include'
make[2]: Nothing to be done for 'check'.
make[2]: Leaving directory '/home/ttn/build/GNU/T/exchange/src/include'
Making check in util
make[2]: Entering directory '/home/ttn/build/GNU/T/exchange/src/util'
make  test_age_restriction test_amount test_crypto test_helper_eddsa test_helper_rsa test_helper_cs test_payto test_url
make[3]: Entering directory '/home/ttn/build/GNU/T/exchange/src/util'
  CC       test_age_restriction.o
  CCLD     test_age_restriction
  CC       test_amount.o
  CCLD     test_amount
  CC       test_crypto.o
  CCLD     test_crypto
  CC       test_helper_eddsa.o
  CCLD     test_helper_eddsa
  CC       test_helper_rsa.o
  CCLD     test_helper_rsa
  CC       test_helper_cs.o
  CCLD     test_helper_cs
  CC       test_payto.o
  CCLD     test_payto
  CC       test_url.o
  CCLD     test_url
make[3]: Leaving directory '/home/ttn/build/GNU/T/exchange/src/util'
make  check-TESTS
make[3]: Entering directory '/home/ttn/build/GNU/T/exchange/src/util'
make[4]: Entering directory '/home/ttn/build/GNU/T/exchange/src/util'
PASS: test_age_restriction
PASS: test_amount
PASS: test_crypto
PASS: test_helper_eddsa
PASS: test_helper_rsa
PASS: test_helper_cs
PASS: test_payto
PASS: test_url
============================================================================
Testsuite summary for taler-exchange 0.8.5
============================================================================
# TOTAL: 8
# PASS:  8
# SKIP:  0
# XFAIL: 0
# FAIL:  0
# XPASS: 0
# ERROR: 0
============================================================================
make[4]: Leaving directory '/home/ttn/build/GNU/T/exchange/src/util'
make[3]: Leaving directory '/home/ttn/build/GNU/T/exchange/src/util'
make[2]: Leaving directory '/home/ttn/build/GNU/T/exchange/src/util'
Making check in json
make[2]: Entering directory '/home/ttn/build/GNU/T/exchange/src/json'
make  test_json test_json_wire
make[3]: Entering directory '/home/ttn/build/GNU/T/exchange/src/json'
  CC       test_json.o
  CCLD     test_json
  CC       test_json_wire.o
  CCLD     test_json_wire
make[3]: Leaving directory '/home/ttn/build/GNU/T/exchange/src/json'
make  check-TESTS
make[3]: Entering directory '/home/ttn/build/GNU/T/exchange/src/json'
make[4]: Entering directory '/home/ttn/build/GNU/T/exchange/src/json'
PASS: test_json
PASS: test_json_wire
============================================================================
Testsuite summary for taler-exchange 0.8.5
============================================================================
# TOTAL: 2
# PASS:  2
# SKIP:  0
# XFAIL: 0
# FAIL:  0
# XPASS: 0
# ERROR: 0
============================================================================
make[4]: Leaving directory '/home/ttn/build/GNU/T/exchange/src/json'
make[3]: Leaving directory '/home/ttn/build/GNU/T/exchange/src/json'
make[2]: Leaving directory '/home/ttn/build/GNU/T/exchange/src/json'
Making check in extensions
make[2]: Entering directory '/home/ttn/build/GNU/T/exchange/src/extensions'
make[2]: Nothing to be done for 'check'.
make[2]: Leaving directory '/home/ttn/build/GNU/T/exchange/src/extensions'
Making check in curl
make[2]: Entering directory '/home/ttn/build/GNU/T/exchange/src/curl'
make[2]: Nothing to be done for 'check'.
make[2]: Leaving directory '/home/ttn/build/GNU/T/exchange/src/curl'
Making check in pq
make[2]: Entering directory '/home/ttn/build/GNU/T/exchange/src/pq'
make  test_pq
make[3]: Entering directory '/home/ttn/build/GNU/T/exchange/src/pq'
  CC       test_pq.o
  CCLD     test_pq
make[3]: Leaving directory '/home/ttn/build/GNU/T/exchange/src/pq'
make  check-TESTS
make[3]: Entering directory '/home/ttn/build/GNU/T/exchange/src/pq'
make[4]: Entering directory '/home/ttn/build/GNU/T/exchange/src/pq'
PASS: test_pq
============================================================================
Testsuite summary for taler-exchange 0.8.5
============================================================================
# TOTAL: 1
# PASS:  1
# SKIP:  0
# XFAIL: 0
# FAIL:  0
# XPASS: 0
# ERROR: 0
============================================================================
make[4]: Leaving directory '/home/ttn/build/GNU/T/exchange/src/pq'
make[3]: Leaving directory '/home/ttn/build/GNU/T/exchange/src/pq'
make[2]: Leaving directory '/home/ttn/build/GNU/T/exchange/src/pq'
Making check in sq
make[2]: Entering directory '/home/ttn/build/GNU/T/exchange/src/sq'
make  test_sq
make[3]: Entering directory '/home/ttn/build/GNU/T/exchange/src/sq'
  CC       test_sq.o
  CCLD     test_sq
make[3]: Leaving directory '/home/ttn/build/GNU/T/exchange/src/sq'
make  check-TESTS
make[3]: Entering directory '/home/ttn/build/GNU/T/exchange/src/sq'
make[4]: Entering directory '/home/ttn/build/GNU/T/exchange/src/sq'
PASS: test_sq
============================================================================
Testsuite summary for taler-exchange 0.8.5
============================================================================
# TOTAL: 1
# PASS:  1
# SKIP:  0
# XFAIL: 0
# FAIL:  0
# XPASS: 0
# ERROR: 0
============================================================================
make[4]: Leaving directory '/home/ttn/build/GNU/T/exchange/src/sq'
make[3]: Leaving directory '/home/ttn/build/GNU/T/exchange/src/sq'
make[2]: Leaving directory '/home/ttn/build/GNU/T/exchange/src/sq'
Making check in templating
make[2]: Entering directory '/home/ttn/build/GNU/T/exchange/src/templating'
make  test_mustach_jansson run-original-tests.sh
make[3]: Entering directory '/home/ttn/build/GNU/T/exchange/src/templating'
  CC       test_mustach_jansson.o
  CCLD     test_mustach_jansson
/usr/bin/ld: cannot find -lmustach.la
collect2: error: ld returned 1 exit status
make[3]: *** [Makefile:750: test_mustach_jansson] Error 1
make[3]: Leaving directory '/home/ttn/build/GNU/T/exchange/src/templating'
make[2]: *** [Makefile:1055: check-am] Error 2
make[2]: Leaving directory '/home/ttn/build/GNU/T/exchange/src/templating'
make[1]: *** [Makefile:524: check-recursive] Error 1
make[1]: Leaving directory '/home/ttn/build/GNU/T/exchange/src'
make: *** [Makefile:507: check-recursive] Error 1
.ttn.exchange-make-check-3.log (8,229 bytes)   
.ttn.check.log (1,494 bytes)   
-*- mode: compilation; default-directory: "~/build/GNU/T/exchange/src/templating/" -*-
Compilation started at Thu Aug 18 05:45:06

V=1 check
+ export PATH=/home/ttn/te/bin:/home/ttn/build/GNU/T/hack:/usr/lib/postgresql/13/bin:/home/ttn/bin:/usr/local/bin:/usr/bin:/bin:/usr/local/games:/usr/games
+ PATH=/home/ttn/te/bin:/home/ttn/build/GNU/T/hack:/usr/lib/postgresql/13/bin:/home/ttn/bin:/usr/local/bin:/usr/bin:/bin:/usr/local/games:/usr/games
+ export TMPDIR=/home/ttn/te/tmp
+ TMPDIR=/home/ttn/te/tmp
+ export PGHOST=/home/ttn/te/pg
+ PGHOST=/home/ttn/te/pg
+ make check
make  test_mustach_jansson run-original-tests.sh
make[1]: Entering directory '/home/ttn/build/GNU/T/exchange/src/templating'
/bin/bash ../../libtool  --tag=CC   --mode=link gcc  -Wall -Wno-address-of-packed-member -g -O2  -L/home/ttn/te/lib -L/home/ttn/te/lib -L/home/ttn/te/lib  -o test_mustach_jansson test_mustach_jansson.o -lgnunetutil -lmustach.la  
libtool: link: gcc -Wall -Wno-address-of-packed-member -g -O2 -o test_mustach_jansson test_mustach_jansson.o  -L/home/ttn/te/lib /home/ttn/te/lib/libgnunetutil.so -lmustach.la -Wl,-rpath -Wl,/home/ttn/te/lib -Wl,-rpath -Wl,/home/ttn/te/lib
/usr/bin/ld: cannot find -lmustach.la
collect2: error: ld returned 1 exit status
make[1]: *** [Makefile:750: test_mustach_jansson] Error 1
make[1]: Leaving directory '/home/ttn/build/GNU/T/exchange/src/templating'
make: *** [Makefile:1055: check-am] Error 2

Compilation exited abnormally with code 2 at Thu Aug 18 05:45:07
.ttn.check.log (1,494 bytes)   

Issue History

Date Modified Username Field Change
2022-07-29 07:25 ttn New Issue
2022-07-29 07:25 ttn Status new => assigned
2022-07-29 07:25 ttn Assigned To => Christian Grothoff
2022-07-29 07:25 ttn File Added: .ttn.exchange-make-check.log
2022-07-29 07:25 ttn File Added: test-suite.log
2022-07-29 20:18 ttn Note Added: 0018974
2022-07-31 16:34 ttn Note Added: 0018977
2022-08-01 00:16 ttn Note Added: 0018978
2022-08-01 12:16 ttn Note Added: 0018979
2022-08-02 16:25 ttn Note Added: 0018981
2022-08-06 22:27 Christian Grothoff Note Added: 0018989
2022-08-07 19:35 ttn Note Added: 0018997
2022-08-07 19:35 ttn File Added: .ttn.exchange-make-check-2.log
2022-08-07 19:35 ttn File Added: test-suite-2.log
2022-08-15 08:21 Christian Grothoff Note Added: 0019006
2022-08-15 08:21 Christian Grothoff Assigned To Christian Grothoff => ttn
2022-08-15 08:21 Christian Grothoff Status assigned => feedback
2022-08-18 05:48 ttn Note Added: 0019018
2022-08-18 05:48 ttn File Added: .ttn.exchange-make-check-3.log
2022-08-18 05:48 ttn File Added: .ttn.check.log