View Issue Details

IDProjectCategoryView StatusLast Update
0006895Talermechant backendpublic2021-05-29 23:00
Reporterttn Assigned ToChristian Grothoff  
PrioritynormalSeverityminorReproducibilityhave not tried
Status resolvedResolutionfixed 
PlatformLinuxOSAlpineOS Version3.13
Product Versiongit (master) 
Target Version0.9Fixed in Version0.9 
Summary0006895: "make check" fails on test-merchantdb-postgres
DescriptionHEAD at c25419a17238ce074979f6a69b2b6de55020a930
Logs attached.
TagsNo tags attached.

Activities

ttn

2021-05-29 11:22

developer  

.ttn.make-check.log (3,403 bytes)   
Making check in .
make[1]: Entering directory '/home/ttn/build/GNU/T/merchant'
make[1]: Leaving directory '/home/ttn/build/GNU/T/merchant'
Making check in src
make[1]: Entering directory '/home/ttn/build/GNU/T/merchant/src'
Making check in include
make[2]: Entering directory '/home/ttn/build/GNU/T/merchant/src/include'
make[2]: Nothing to be done for 'check'.
make[2]: Leaving directory '/home/ttn/build/GNU/T/merchant/src/include'
Making check in mustach
make[2]: Entering directory '/home/ttn/build/GNU/T/merchant/src/mustach'
make  test_mustach_jansson run-original-tests.sh
make[3]: Entering directory '/home/ttn/build/GNU/T/merchant/src/mustach'
  CC       test_mustach_jansson.o
  CCLD     test_mustach_jansson
/usr/lib/gcc/x86_64-alpine-linux-musl/10.2.1/../../../../x86_64-alpine-linux-musl/bin/ld: warning: libintl.so.8, needed by /usr/local/lib/libgnunetutil.so, may conflict with libintl.so.9
make[3]: Nothing to be done for 'run-original-tests.sh'.
make[3]: Leaving directory '/home/ttn/build/GNU/T/merchant/src/mustach'
make  check-TESTS
make[3]: Entering directory '/home/ttn/build/GNU/T/merchant/src/mustach'
make[4]: Entering directory '/home/ttn/build/GNU/T/merchant/src/mustach'
SKIP: run-original-tests.sh
PASS: test_mustach_jansson
============================================================================
Testsuite summary for taler-merchant 0.8.0
============================================================================
# TOTAL: 2
# PASS:  1
# SKIP:  1
# XFAIL: 0
# FAIL:  0
# XPASS: 0
# ERROR: 0
============================================================================
make[4]: Leaving directory '/home/ttn/build/GNU/T/merchant/src/mustach'
make[3]: Leaving directory '/home/ttn/build/GNU/T/merchant/src/mustach'
make[2]: Leaving directory '/home/ttn/build/GNU/T/merchant/src/mustach'
Making check in backenddb
make[2]: Entering directory '/home/ttn/build/GNU/T/merchant/src/backenddb'
make  test-merchantdb-postgres
make[3]: Entering directory '/home/ttn/build/GNU/T/merchant/src/backenddb'
  CC       test_merchantdb.o
  CCLD     test-merchantdb-postgres
make[3]: Leaving directory '/home/ttn/build/GNU/T/merchant/src/backenddb'
make  check-TESTS
make[3]: Entering directory '/home/ttn/build/GNU/T/merchant/src/backenddb'
make[4]: Entering directory '/home/ttn/build/GNU/T/merchant/src/backenddb'
FAIL: test-merchantdb-postgres
============================================================================
Testsuite summary for taler-merchant 0.8.0
============================================================================
# TOTAL: 1
# PASS:  0
# SKIP:  0
# XFAIL: 0
# FAIL:  1
# XPASS: 0
# ERROR: 0
============================================================================
See src/backenddb/test-suite.log
Please report to taler-bug@gnunet.org
============================================================================
make[4]: *** [Makefile:956: test-suite.log] Error 1
make[4]: Leaving directory '/home/ttn/build/GNU/T/merchant/src/backenddb'
make[3]: *** [Makefile:1064: check-TESTS] Error 2
make[3]: Leaving directory '/home/ttn/build/GNU/T/merchant/src/backenddb'
make[2]: *** [Makefile:1138: check-am] Error 2
make[2]: Leaving directory '/home/ttn/build/GNU/T/merchant/src/backenddb'
make[1]: *** [Makefile:411: check-recursive] Error 1
make[1]: Leaving directory '/home/ttn/build/GNU/T/merchant/src'
make: *** [Makefile:472: check-recursive] Error 1
.ttn.make-check.log (3,403 bytes)   
test-suite.log (3,755 bytes)   
========================================================
   taler-merchant 0.8.0: src/backenddb/test-suite.log
========================================================

# TOTAL: 1
# PASS:  0
# SKIP:  0
# XFAIL: 0
# FAIL:  1
# XPASS: 0
# ERROR: 0

.. contents:: :depth: 2

FAIL: test-merchantdb-postgres
==============================

May 29 10:39:10-332212 /home/ttn/build/GNU/T/merchant/src/backenddb/.libs/lt-test-merchantdb-postgres-10830 INFO Loading SQL resources from `/usr/local/share/taler//sql/merchant/drop'
May 29 10:39:10-333796 /home/ttn/build/GNU/T/merchant/src/backenddb/.libs/lt-test-merchantdb-postgres-10830 INFO Applying SQL file `/usr/local/share/taler//sql/merchant/drop0001.sql' on database postgres:///talercheck
May 29 10:39:10-536837 /home/ttn/build/GNU/T/merchant/src/backenddb/.libs/lt-test-merchantdb-postgres-10830 INFO Applying SQL file `/usr/local/share/taler//sql/merchant/drop0002.sql' on database postgres:///talercheck
May 29 10:39:10-559349 /home/ttn/build/GNU/T/merchant/src/backenddb/.libs/lt-test-merchantdb-postgres-10830 INFO Loading SQL resources from `/usr/local/share/taler//sql/merchant/merchant-'
May 29 10:39:10-561577 /home/ttn/build/GNU/T/merchant/src/backenddb/.libs/lt-test-merchantdb-postgres-10830 INFO Applying SQL file `/usr/local/share/taler//sql/merchant/merchant-0001.sql' on database postgres:///talercheck
May 29 10:39:14-510193 /home/ttn/build/GNU/T/merchant/src/backenddb/.libs/lt-test-merchantdb-postgres-10830 INFO Applying SQL file `/usr/local/share/taler//sql/merchant/merchant-0002.sql' on database postgres:///talercheck
May 29 10:39:15-146289 /home/ttn/build/GNU/T/merchant/src/backenddb/.libs/lt-test-merchantdb-postgres-10830 INFO Storing wire fee for NBVKAFSA starting at Sat May 29 10:39:15 2021 of EUR:0.49
May 29 10:39:15-157246 /home/ttn/build/GNU/T/merchant/src/backenddb/.libs/lt-test-merchantdb-postgres-10830 INFO Storing wire fee for NBVKAFSA starting at Sat May 29 10:39:15 2021 of EUR:0.49
May 29 10:39:15-158060 /home/ttn/build/GNU/T/merchant/src/backenddb/.libs/lt-test-merchantdb-postgres-10830 INFO Storing wire fee for NBVKAFSA starting at Sat May 29 10:39:15 2021 of EUR:0.49
May 29 10:39:15-255899 /home/ttn/build/GNU/T/merchant/src/backenddb/.libs/lt-test-merchantdb-postgres-10830 INFO Starting merchant DB transaction insert transfer details (READ COMMITTED)
May 29 10:39:15-262426 /home/ttn/build/GNU/T/merchant/src/backenddb/.libs/lt-test-merchantdb-postgres-10830 INFO Committing merchant DB transaction insert transfer details
May 29 10:39:15-470755 /home/ttn/build/GNU/T/merchant/src/backenddb/.libs/lt-test-merchantdb-postgres-10830 INFO Starting merchant DB transaction `insert reserve'
May 29 10:39:15-474268 /home/ttn/build/GNU/T/merchant/src/backenddb/.libs/lt-test-merchantdb-postgres-10830 INFO Committing merchant DB transaction insert reserve
May 29 10:39:15-494830 /home/ttn/build/GNU/T/merchant/src/backenddb/.libs/lt-test-merchantdb-postgres-10830 INFO Starting merchant DB transaction `enable tip reserve'
May 29 10:39:15-498103 /home/ttn/build/GNU/T/merchant/src/backenddb/.libs/lt-test-merchantdb-postgres-10830 INFO Committing merchant DB transaction enable tip reserve
May 29 10:39:15-552948 /home/ttn/build/GNU/T/merchant/src/backenddb/.libs/lt-test-merchantdb-postgres-10830 INFO Starting merchant DB transaction `enable tip reserve'
May 29 10:39:15-553577 /home/ttn/build/GNU/T/merchant/src/backenddb/.libs/lt-test-merchantdb-postgres-10830 INFO Rolling back merchant DB transaction `enable tip reserve'
May 29 10:39:15-555981 /home/ttn/build/GNU/T/merchant/src/backenddb/.libs/lt-test-merchantdb-postgres-10830 INFO Starting merchant DB transaction `insert reserve'
Segmentation fault
FAIL test-merchantdb-postgres (exit status: 139)

test-suite.log (3,755 bytes)   

Christian Grothoff

2021-05-29 23:00

manager   ~0017933

Reproduced, fixed in Git master.

Issue History

Date Modified Username Field Change
2021-05-29 11:22 ttn New Issue
2021-05-29 11:22 ttn Status new => assigned
2021-05-29 11:22 ttn Assigned To => Christian Grothoff
2021-05-29 11:22 ttn File Added: .ttn.make-check.log
2021-05-29 11:22 ttn File Added: test-suite.log
2021-05-29 23:00 Christian Grothoff Status assigned => resolved
2021-05-29 23:00 Christian Grothoff Resolution open => fixed
2021-05-29 23:00 Christian Grothoff Fixed in Version => 0.9
2021-05-29 23:00 Christian Grothoff Note Added: 0017933
2021-05-29 23:00 Christian Grothoff Target Version => 0.9