View Issue Details

IDProjectCategoryView StatusLast Update
0006847Talerexchange API (C)public2021-04-24 19:08
Reporterttn Assigned ToChristian Grothoff  
PrioritynormalSeverityminorReproducibilityhave not tried
Status resolvedResolutionfixed 
PlatformLinuxOSDebianOS VersionBullseye/Sid
Product Versiongit (master) 
Target Version0.9Fixed in Version0.9 
Summary0006847: "make check" fails in test_url
Descriptionlogs attached
TagsNo tags attached.

Activities

ttn

2021-04-24 18:20

developer  

.ttn.exchange-make-check.log (4,681 bytes)   
-*- mode: compilation; default-directory: "~/build/GNU/T/exchange/" -*-
Compilation started at Sat Apr 24 18:12:54

make check PGHOST=$HOME/pg TMPDIR=$HOME/tmp PATH=$HOME/t/bin:$PATH
Makefile:963: warning: overriding recipe for target 'doxygen-doc/taler-exchange.tag'
Makefile:958: warning: ignoring old recipe for target 'doxygen-doc/taler-exchange.tag'
Makefile:968: warning: overriding recipe for target 'doxygen-doc/taler-exchange.tag'
Makefile:963: warning: ignoring old recipe for target 'doxygen-doc/taler-exchange.tag'
Makefile:973: warning: overriding recipe for target 'doxygen-doc/taler-exchange.tag'
Makefile:968: warning: ignoring old recipe for target 'doxygen-doc/taler-exchange.tag'
make  check-recursive
make[1]: Entering directory '/home/ttn/build/GNU/T/exchange'
Makefile:963: warning: overriding recipe for target 'doxygen-doc/taler-exchange.tag'
Makefile:958: warning: ignoring old recipe for target 'doxygen-doc/taler-exchange.tag'
Makefile:968: warning: overriding recipe for target 'doxygen-doc/taler-exchange.tag'
Makefile:963: warning: ignoring old recipe for target 'doxygen-doc/taler-exchange.tag'
Makefile:973: warning: overriding recipe for target 'doxygen-doc/taler-exchange.tag'
Makefile:968: warning: ignoring old recipe for target 'doxygen-doc/taler-exchange.tag'
Making check in .
make[2]: Entering directory '/home/ttn/build/GNU/T/exchange'
Makefile:963: warning: overriding recipe for target 'doxygen-doc/taler-exchange.tag'
Makefile:958: warning: ignoring old recipe for target 'doxygen-doc/taler-exchange.tag'
Makefile:968: warning: overriding recipe for target 'doxygen-doc/taler-exchange.tag'
Makefile:963: warning: ignoring old recipe for target 'doxygen-doc/taler-exchange.tag'
Makefile:973: warning: overriding recipe for target 'doxygen-doc/taler-exchange.tag'
Makefile:968: warning: ignoring old recipe for target 'doxygen-doc/taler-exchange.tag'
make[2]: Leaving directory '/home/ttn/build/GNU/T/exchange'
Making check in contrib
make[2]: Entering directory '/home/ttn/build/GNU/T/exchange/contrib'
Making check in .
make[3]: Entering directory '/home/ttn/build/GNU/T/exchange/contrib'
make[3]: Nothing to be done for 'check-am'.
make[3]: Leaving directory '/home/ttn/build/GNU/T/exchange/contrib'
make[2]: Leaving directory '/home/ttn/build/GNU/T/exchange/contrib'
Making check in src
make[2]: Entering directory '/home/ttn/build/GNU/T/exchange/src'
Making check in include
make[3]: Entering directory '/home/ttn/build/GNU/T/exchange/src/include'
make[3]: Nothing to be done for 'check'.
make[3]: Leaving directory '/home/ttn/build/GNU/T/exchange/src/include'
Making check in util
make[3]: Entering directory '/home/ttn/build/GNU/T/exchange/src/util'
make  test_amount test_crypto test_helper_eddsa test_helper_rsa test_payto test_url
make[4]: Entering directory '/home/ttn/build/GNU/T/exchange/src/util'
  CC       test_amount.o
  CCLD     test_amount
  CC       test_crypto.o
  CCLD     test_crypto
  CC       test_helper_eddsa.o
  CCLD     test_helper_eddsa
  CC       test_helper_rsa.o
  CCLD     test_helper_rsa
  CC       test_payto.o
  CCLD     test_payto
  CC       test_url.o
  CCLD     test_url
make[4]: Leaving directory '/home/ttn/build/GNU/T/exchange/src/util'
make  check-TESTS
make[4]: Entering directory '/home/ttn/build/GNU/T/exchange/src/util'
make[5]: Entering directory '/home/ttn/build/GNU/T/exchange/src/util'
PASS: test_amount
PASS: test_crypto
PASS: test_helper_eddsa
PASS: test_helper_rsa
PASS: test_payto
FAIL: test_url
============================================================================
Testsuite summary for taler-exchange 0.8.1
============================================================================
# TOTAL: 6
# PASS:  5
# SKIP:  0
# XFAIL: 0
# FAIL:  1
# XPASS: 0
# ERROR: 0
============================================================================
See src/util/test-suite.log
Please report to taler-bug@gnunet.org
============================================================================
make[5]: *** [Makefile:1141: test-suite.log] Error 1
make[5]: Leaving directory '/home/ttn/build/GNU/T/exchange/src/util'
make[4]: *** [Makefile:1249: check-TESTS] Error 2
make[4]: Leaving directory '/home/ttn/build/GNU/T/exchange/src/util'
make[3]: *** [Makefile:1358: check-am] Error 2
make[3]: Leaving directory '/home/ttn/build/GNU/T/exchange/src/util'
make[2]: *** [Makefile:515: check-recursive] Error 1
make[2]: Leaving directory '/home/ttn/build/GNU/T/exchange/src'
make[1]: *** [Makefile:501: check-recursive] Error 1
make[1]: Leaving directory '/home/ttn/build/GNU/T/exchange'
make: *** [Makefile:799: check] Error 2

Compilation exited abnormally with code 2 at Sat Apr 24 18:13:02
.ttn.exchange-make-check.log (4,681 bytes)   
test-suite.log (320 bytes)   
===================================================
   taler-exchange 0.8.1: src/util/test-suite.log
===================================================

# TOTAL: 6
# PASS:  5
# SKIP:  0
# XFAIL: 0
# FAIL:  1
# XPASS: 0
# ERROR: 0

.. contents:: :depth: 2

FAIL: test_url
==============

FAIL test_url (exit status: 1)

test-suite.log (320 bytes)   

Christian Grothoff

2021-04-24 19:06

manager   ~0017780

ttn, did you get any of my e-mails?

Christian Grothoff

2021-04-24 19:08

manager   ~0017781

Trivial, was intentional, now removed.

Issue History

Date Modified Username Field Change
2021-04-24 18:20 ttn New Issue
2021-04-24 18:20 ttn Status new => assigned
2021-04-24 18:20 ttn Assigned To => Christian Grothoff
2021-04-24 18:20 ttn File Added: .ttn.exchange-make-check.log
2021-04-24 18:20 ttn File Added: test-suite.log
2021-04-24 19:06 Christian Grothoff Note Added: 0017780
2021-04-24 19:08 Christian Grothoff Status assigned => resolved
2021-04-24 19:08 Christian Grothoff Resolution open => fixed
2021-04-24 19:08 Christian Grothoff Fixed in Version => 0.9
2021-04-24 19:08 Christian Grothoff Note Added: 0017781
2021-04-24 19:08 Christian Grothoff Target Version => 0.9