View Issue Details

IDProjectCategoryView StatusLast Update
0006685Talerauditorpublic2021-01-11 10:53
Reporterttn Assigned ToChristian Grothoff  
PrioritynormalSeverityminorReproducibilityhave not tried
Status resolvedResolutionfixed 
PlatformLinuxOSDevuanOS VersionBeowulf/Chimaera
Product Versiongit (master) 
Target Version0.9Fixed in Version0.9 
Summary0006685: "make check" fails on test_auditor_api
DescriptionThis was from a "git pull" a few hours ago (HEAD = commit 543cd6d342d1382746d749).
Logs attached.
TagsNo tags attached.

Activities

ttn

2021-01-11 09:45

developer  

.ttn.exchange-make-check.log (15,371 bytes)   
-*- mode: compilation; default-directory: "~/build/GNU/T/exchange/" -*-
Compilation started at Sun Jan 10 22:26:48

make check PGHOST=/tmp/pg
make  check-recursive
make[1]: ingresso nella directory «/home/ttn/build/GNU/T/exchange»
Making check in .
make[2]: ingresso nella directory «/home/ttn/build/GNU/T/exchange»
make[2]: uscita dalla directory «/home/ttn/build/GNU/T/exchange»
Making check in contrib
make[2]: ingresso nella directory «/home/ttn/build/GNU/T/exchange/contrib»
Making check in .
make[3]: ingresso nella directory «/home/ttn/build/GNU/T/exchange/contrib»
make[3]: Nessuna operazione da eseguire per «check-am».
make[3]: uscita dalla directory «/home/ttn/build/GNU/T/exchange/contrib»
make[2]: uscita dalla directory «/home/ttn/build/GNU/T/exchange/contrib»
Making check in src
make[2]: ingresso nella directory «/home/ttn/build/GNU/T/exchange/src»
Making check in include
make[3]: ingresso nella directory «/home/ttn/build/GNU/T/exchange/src/include»
make[3]: Nessuna operazione da eseguire per «check».
make[3]: uscita dalla directory «/home/ttn/build/GNU/T/exchange/src/include»
Making check in util
make[3]: ingresso nella directory «/home/ttn/build/GNU/T/exchange/src/util»
make  test_amount test_crypto test_helper_eddsa test_helper_rsa test_payto test_url
make[4]: ingresso nella directory «/home/ttn/build/GNU/T/exchange/src/util»
make[4]: «test_amount» è aggiornato.
make[4]: «test_crypto» è aggiornato.
make[4]: «test_helper_eddsa» è aggiornato.
make[4]: «test_helper_rsa» è aggiornato.
make[4]: «test_payto» è aggiornato.
make[4]: «test_url» è aggiornato.
make[4]: uscita dalla directory «/home/ttn/build/GNU/T/exchange/src/util»
make  check-TESTS
make[4]: ingresso nella directory «/home/ttn/build/GNU/T/exchange/src/util»
make[5]: ingresso nella directory «/home/ttn/build/GNU/T/exchange/src/util»
PASS: test_amount
PASS: test_crypto
PASS: test_helper_eddsa
PASS: test_helper_rsa
PASS: test_payto
PASS: test_url
============================================================================
Testsuite summary for taler-exchange 0.8.1
============================================================================
# TOTAL: 6
# PASS:  6
# SKIP:  0
# XFAIL: 0
# FAIL:  0
# XPASS: 0
# ERROR: 0
============================================================================
make[5]: uscita dalla directory «/home/ttn/build/GNU/T/exchange/src/util»
make[4]: uscita dalla directory «/home/ttn/build/GNU/T/exchange/src/util»
make[3]: uscita dalla directory «/home/ttn/build/GNU/T/exchange/src/util»
Making check in json
make[3]: ingresso nella directory «/home/ttn/build/GNU/T/exchange/src/json»
make  test_json test_json_wire
make[4]: ingresso nella directory «/home/ttn/build/GNU/T/exchange/src/json»
  CC       test_json.o
  CCLD     test_json
  CC       test_json_wire.o
  CCLD     test_json_wire
make[4]: uscita dalla directory «/home/ttn/build/GNU/T/exchange/src/json»
make  check-TESTS
make[4]: ingresso nella directory «/home/ttn/build/GNU/T/exchange/src/json»
make[5]: ingresso nella directory «/home/ttn/build/GNU/T/exchange/src/json»
PASS: test_json
PASS: test_json_wire
============================================================================
Testsuite summary for taler-exchange 0.8.1
============================================================================
# TOTAL: 2
# PASS:  2
# SKIP:  0
# XFAIL: 0
# FAIL:  0
# XPASS: 0
# ERROR: 0
============================================================================
make[5]: uscita dalla directory «/home/ttn/build/GNU/T/exchange/src/json»
make[4]: uscita dalla directory «/home/ttn/build/GNU/T/exchange/src/json»
make[3]: uscita dalla directory «/home/ttn/build/GNU/T/exchange/src/json»
Making check in curl
make[3]: ingresso nella directory «/home/ttn/build/GNU/T/exchange/src/curl»
make[3]: Nessuna operazione da eseguire per «check».
make[3]: uscita dalla directory «/home/ttn/build/GNU/T/exchange/src/curl»
Making check in pq
make[3]: ingresso nella directory «/home/ttn/build/GNU/T/exchange/src/pq»
make  test_pq
make[4]: ingresso nella directory «/home/ttn/build/GNU/T/exchange/src/pq»
  CC       test_pq.o
  CCLD     test_pq
make[4]: uscita dalla directory «/home/ttn/build/GNU/T/exchange/src/pq»
make  check-TESTS
make[4]: ingresso nella directory «/home/ttn/build/GNU/T/exchange/src/pq»
make[5]: ingresso nella directory «/home/ttn/build/GNU/T/exchange/src/pq»
PASS: test_pq
============================================================================
Testsuite summary for taler-exchange 0.8.1
============================================================================
# TOTAL: 1
# PASS:  1
# SKIP:  0
# XFAIL: 0
# FAIL:  0
# XPASS: 0
# ERROR: 0
============================================================================
make[5]: uscita dalla directory «/home/ttn/build/GNU/T/exchange/src/pq»
make[4]: uscita dalla directory «/home/ttn/build/GNU/T/exchange/src/pq»
make[3]: uscita dalla directory «/home/ttn/build/GNU/T/exchange/src/pq»
Making check in sq
make[3]: ingresso nella directory «/home/ttn/build/GNU/T/exchange/src/sq»
make  test_sq
make[4]: ingresso nella directory «/home/ttn/build/GNU/T/exchange/src/sq»
  CC       test_sq.o
  CCLD     test_sq
make[4]: uscita dalla directory «/home/ttn/build/GNU/T/exchange/src/sq»
make  check-TESTS
make[4]: ingresso nella directory «/home/ttn/build/GNU/T/exchange/src/sq»
make[5]: ingresso nella directory «/home/ttn/build/GNU/T/exchange/src/sq»
PASS: test_sq
============================================================================
Testsuite summary for taler-exchange 0.8.1
============================================================================
# TOTAL: 1
# PASS:  1
# SKIP:  0
# XFAIL: 0
# FAIL:  0
# XPASS: 0
# ERROR: 0
============================================================================
make[5]: uscita dalla directory «/home/ttn/build/GNU/T/exchange/src/sq»
make[4]: uscita dalla directory «/home/ttn/build/GNU/T/exchange/src/sq»
make[3]: uscita dalla directory «/home/ttn/build/GNU/T/exchange/src/sq»
Making check in mhd
make[3]: ingresso nella directory «/home/ttn/build/GNU/T/exchange/src/mhd»
make[3]: Nessuna operazione da eseguire per «check».
make[3]: uscita dalla directory «/home/ttn/build/GNU/T/exchange/src/mhd»
Making check in bank-lib
make[3]: ingresso nella directory «/home/ttn/build/GNU/T/exchange/src/bank-lib»
make[3]: Nessuna operazione da eseguire per «check».
make[3]: uscita dalla directory «/home/ttn/build/GNU/T/exchange/src/bank-lib»
Making check in exchangedb
make[3]: ingresso nella directory «/home/ttn/build/GNU/T/exchange/src/exchangedb»
make  test-exchangedb-postgres
make[4]: ingresso nella directory «/home/ttn/build/GNU/T/exchange/src/exchangedb»
  CC       test_exchangedb.o
  CCLD     test-exchangedb-postgres
make[4]: uscita dalla directory «/home/ttn/build/GNU/T/exchange/src/exchangedb»
make  check-TESTS
make[4]: ingresso nella directory «/home/ttn/build/GNU/T/exchange/src/exchangedb»
make[5]: ingresso nella directory «/home/ttn/build/GNU/T/exchange/src/exchangedb»
PASS: test-exchangedb-postgres
============================================================================
Testsuite summary for taler-exchange 0.8.1
============================================================================
# TOTAL: 1
# PASS:  1
# SKIP:  0
# XFAIL: 0
# FAIL:  0
# XPASS: 0
# ERROR: 0
============================================================================
make[5]: uscita dalla directory «/home/ttn/build/GNU/T/exchange/src/exchangedb»
make[4]: uscita dalla directory «/home/ttn/build/GNU/T/exchange/src/exchangedb»
make[3]: uscita dalla directory «/home/ttn/build/GNU/T/exchange/src/exchangedb»
Making check in exchange
make[3]: ingresso nella directory «/home/ttn/build/GNU/T/exchange/src/exchange»
make  test_taler_exchange_httpd.sh test_taler_exchange_httpd_restart.sh 
make[4]: ingresso nella directory «/home/ttn/build/GNU/T/exchange/src/exchange»
make[4]: Nessuna operazione da eseguire per «test_taler_exchange_httpd.sh».
make[4]: Nessuna operazione da eseguire per «test_taler_exchange_httpd_restart.sh».
make[4]: uscita dalla directory «/home/ttn/build/GNU/T/exchange/src/exchange»
make  check-TESTS
make[4]: ingresso nella directory «/home/ttn/build/GNU/T/exchange/src/exchange»
make[5]: ingresso nella directory «/home/ttn/build/GNU/T/exchange/src/exchange»
PASS: test_taler_exchange_httpd.sh
PASS: test_taler_exchange_httpd_restart.sh
============================================================================
Testsuite summary for taler-exchange 0.8.1
============================================================================
# TOTAL: 2
# PASS:  2
# SKIP:  0
# XFAIL: 0
# FAIL:  0
# XPASS: 0
# ERROR: 0
============================================================================
make[5]: uscita dalla directory «/home/ttn/build/GNU/T/exchange/src/exchange»
make[4]: uscita dalla directory «/home/ttn/build/GNU/T/exchange/src/exchange»
make[3]: uscita dalla directory «/home/ttn/build/GNU/T/exchange/src/exchange»
Making check in auditordb
make[3]: ingresso nella directory «/home/ttn/build/GNU/T/exchange/src/auditordb»
make  test-auditordb-postgres
make[4]: ingresso nella directory «/home/ttn/build/GNU/T/exchange/src/auditordb»
  CC       test_auditordb.o
  CCLD     test-auditordb-postgres
make[4]: uscita dalla directory «/home/ttn/build/GNU/T/exchange/src/auditordb»
make  check-TESTS
make[4]: ingresso nella directory «/home/ttn/build/GNU/T/exchange/src/auditordb»
make[5]: ingresso nella directory «/home/ttn/build/GNU/T/exchange/src/auditordb»
PASS: test-auditordb-postgres
============================================================================
Testsuite summary for taler-exchange 0.8.1
============================================================================
# TOTAL: 1
# PASS:  1
# SKIP:  0
# XFAIL: 0
# FAIL:  0
# XPASS: 0
# ERROR: 0
============================================================================
make[5]: uscita dalla directory «/home/ttn/build/GNU/T/exchange/src/auditordb»
make[4]: uscita dalla directory «/home/ttn/build/GNU/T/exchange/src/auditordb»
make[3]: uscita dalla directory «/home/ttn/build/GNU/T/exchange/src/auditordb»
Making check in auditor
make[3]: ingresso nella directory «/home/ttn/build/GNU/T/exchange/src/auditor»
make  test-auditor.sh test-revocation.sh
make[4]: ingresso nella directory «/home/ttn/build/GNU/T/exchange/src/auditor»
make[4]: Nessuna operazione da eseguire per «test-auditor.sh».
make[4]: Nessuna operazione da eseguire per «test-revocation.sh».
make[4]: uscita dalla directory «/home/ttn/build/GNU/T/exchange/src/auditor»
make  check-TESTS
make[4]: ingresso nella directory «/home/ttn/build/GNU/T/exchange/src/auditor»
make[5]: ingresso nella directory «/home/ttn/build/GNU/T/exchange/src/auditor»
SKIP: test-auditor.sh
SKIP: test-revocation.sh
============================================================================
Testsuite summary for taler-exchange 0.8.1
============================================================================
# TOTAL: 2
# PASS:  0
# SKIP:  2
# XFAIL: 0
# FAIL:  0
# XPASS: 0
# ERROR: 0
============================================================================
make[5]: uscita dalla directory «/home/ttn/build/GNU/T/exchange/src/auditor»
make[4]: uscita dalla directory «/home/ttn/build/GNU/T/exchange/src/auditor»
make[3]: uscita dalla directory «/home/ttn/build/GNU/T/exchange/src/auditor»
Making check in lib
make[3]: ingresso nella directory «/home/ttn/build/GNU/T/exchange/src/lib»
make[3]: Nessuna operazione da eseguire per «check».
make[3]: uscita dalla directory «/home/ttn/build/GNU/T/exchange/src/lib»
Making check in exchange-tools
make[3]: ingresso nella directory «/home/ttn/build/GNU/T/exchange/src/exchange-tools»
make[3]: Nessuna operazione da eseguire per «check».
make[3]: uscita dalla directory «/home/ttn/build/GNU/T/exchange/src/exchange-tools»
Making check in testing
make[3]: ingresso nella directory «/home/ttn/build/GNU/T/exchange/src/testing»
make  test_auditor_api test_auditor_api_version test_bank_api_with_fakebank test_bank_api_with_pybank test_bank_api_with_nexus test_exchange_api test_exchange_api_keys_cherry_picking test_exchange_api_revocation test_exchange_api_overlapping_keys_bug test_exchange_management_api test_taler_exchange_aggregator-postgres test_taler_exchange_wirewatch-postgres 
make[4]: ingresso nella directory «/home/ttn/build/GNU/T/exchange/src/testing»
  CC       test_auditor_api.o
  CCLD     test_auditor_api
  CC       test_auditor_api_version.o
  CCLD     test_auditor_api_version
  CC       test_bank_api.o
  CCLD     test_bank_api_with_fakebank
  CCLD     test_bank_api_with_pybank
  CCLD     test_bank_api_with_nexus
  CC       test_exchange_api.o
  CCLD     test_exchange_api
  CC       test_exchange_api_keys_cherry_picking.o
  CCLD     test_exchange_api_keys_cherry_picking
  CC       test_exchange_api_revocation.o
  CCLD     test_exchange_api_revocation
  CC       test_exchange_api_overlapping_keys_bug.o
  CCLD     test_exchange_api_overlapping_keys_bug
  CC       test_exchange_management_api.o
  CCLD     test_exchange_management_api
  CC       test_taler_exchange_aggregator.o
  CCLD     test_taler_exchange_aggregator-postgres
  CC       test_taler_exchange_wirewatch.o
  CCLD     test_taler_exchange_wirewatch-postgres
make[4]: uscita dalla directory «/home/ttn/build/GNU/T/exchange/src/testing»
make  check-TESTS
make[4]: ingresso nella directory «/home/ttn/build/GNU/T/exchange/src/testing»
make[5]: ingresso nella directory «/home/ttn/build/GNU/T/exchange/src/testing»
FAIL: test_auditor_api
PASS: test_auditor_api_version
PASS: test_bank_api_with_fakebank
SKIP: test_bank_api_with_pybank
SKIP: test_bank_api_with_nexus
PASS: test_exchange_api
PASS: test_exchange_api_keys_cherry_picking
PASS: test_exchange_api_revocation
PASS: test_exchange_api_overlapping_keys_bug
PASS: test_exchange_management_api
PASS: test_taler_exchange_aggregator-postgres
PASS: test_taler_exchange_wirewatch-postgres
============================================================================
Testsuite summary for taler-exchange 0.8.1
============================================================================
# TOTAL: 12
# PASS:  9
# SKIP:  2
# XFAIL: 0
# FAIL:  1
# XPASS: 0
# ERROR: 0
============================================================================
See src/testing/test-suite.log
Please report to taler-bug@gnunet.org
============================================================================
make[5]: *** [Makefile:1612: test-suite.log] Errore 1
make[5]: uscita dalla directory «/home/ttn/build/GNU/T/exchange/src/testing»
make[4]: *** [Makefile:1720: check-TESTS] Errore 2
make[4]: uscita dalla directory «/home/ttn/build/GNU/T/exchange/src/testing»
make[3]: *** [Makefile:1892: check-am] Errore 2
make[3]: uscita dalla directory «/home/ttn/build/GNU/T/exchange/src/testing»
make[2]: *** [Makefile:492: check-recursive] Errore 1
make[2]: uscita dalla directory «/home/ttn/build/GNU/T/exchange/src»
make[1]: *** [Makefile:477: check-recursive] Errore 1
make[1]: uscita dalla directory «/home/ttn/build/GNU/T/exchange»
make: *** [Makefile:775: check] Errore 2

Compilation exited abnormally with code 2 at Sun Jan 10 22:28:10
.ttn.exchange-make-check.log (15,371 bytes)   
test-suite.log (660,889 bytes)

Christian Grothoff

2021-01-11 10:42

manager   ~0017334

Yep, fails for me too. Some strange regression, will investigate.

Christian Grothoff

2021-01-11 10:53

manager   ~0017335

Fixed in 3a264434..5eed6115

Issue History

Date Modified Username Field Change
2021-01-11 09:45 ttn New Issue
2021-01-11 09:45 ttn Status new => assigned
2021-01-11 09:45 ttn Assigned To => Christian Grothoff
2021-01-11 09:45 ttn File Added: .ttn.exchange-make-check.log
2021-01-11 09:45 ttn File Added: test-suite.log
2021-01-11 10:42 Christian Grothoff Note Added: 0017334
2021-01-11 10:53 Christian Grothoff Status assigned => resolved
2021-01-11 10:53 Christian Grothoff Resolution open => fixed
2021-01-11 10:53 Christian Grothoff Fixed in Version => 0.9
2021-01-11 10:53 Christian Grothoff Note Added: 0017335
2021-01-11 10:53 Christian Grothoff Target Version => 0.9