View Issue Details

IDProjectCategoryView StatusLast Update
0006630Talerbank (demonstrator)public2020-10-29 15:23
ReporterChristian Grothoff Assigned ToMS  
PriorityurgentSeveritycrashReproducibilityalways
Status resolvedResolutionfixed 
Platformi7OSDebian GNU/LinuxOS Versionsqueeze
Product Versiongit (master) 
Target Version0.8 
Summary0006630: make check fails
Description$ make check
./run-tests.sh
Creating test database for alias 'default'...
System check identified no issues (0 silenced).
.......................F...s
======================================================================
FAIL: test_register (talerbank.app.tests.RegisterTestCase)
----------------------------------------------------------------------
Traceback (most recent call last):
  File "/home/grothoff/taler/bank/talerbank/app/tests.py", line 402, in test_register
    self.assertIn(("/profile", 302), response.redirect_chain)
AssertionError: ('/profile', 302) not found in [('/en/profile', 302)]

----------------------------------------------------------------------
Ran 28 tests in 7.927s

FAILED (failures=1, skipped=1)
Destroying test database for alias 'default'...
make: *** [Makefile:40: check] Error 1
TagsNo tags attached.

Activities

MS

2020-10-29 15:22

manager   ~0017060

Fixed here: e65dbf1532236e4a9780ac6b88724f41e810c587.

Issue History

Date Modified Username Field Change
2020-10-29 00:07 Christian Grothoff New Issue
2020-10-29 00:07 Christian Grothoff Status new => assigned
2020-10-29 00:07 Christian Grothoff Assigned To => MS
2020-10-29 15:22 MS Note Added: 0017060
2020-10-29 15:23 MS Status assigned => resolved
2020-10-29 15:23 MS Resolution open => fixed