View Issue Details

IDProjectCategoryView StatusLast Update
0007217Talerexchangepublic2022-04-14 07:33
Reporterttn Assigned ToChristian Grothoff  
PrioritynormalSeverityminorReproducibilityhave not tried
Status resolvedResolutionfixed 
PlatformLinuxOSUbuntuOS Version20.04.3
Product Versiongit (master) 
Summary0007217: "make check" fails 15 tests
DescriptionHEAD at 393cea46d1b76b0229272edbc334f0471a069154.
Logs attached.
TagsNo tags attached.

Activities

ttn

2022-04-03 03:23

developer  

.ttn.exchange-make-check.log (17,129 bytes)   
+ export PATH=/home/ttn/te/bin:/mnt/hack:/usr/local/sbin:/usr/local/bin:/usr/sbin:/usr/bin:/sbin:/bin:/usr/games:/usr/local/games:/snap/bin
+ PATH=/home/ttn/te/bin:/mnt/hack:/usr/local/sbin:/usr/local/bin:/usr/sbin:/usr/bin:/sbin:/bin:/usr/games:/usr/local/games:/snap/bin
+ export TMPDIR=/home/ttn/te/tmp
+ TMPDIR=/home/ttn/te/tmp
+ export PGHOST=/home/ttn/te/pg
+ PGHOST=/home/ttn/te/pg
+ make check
make  check-recursive
make[1]: Entering directory '/home/ttn/build/GNU/T/exchange'
Making check in .
make[2]: Entering directory '/home/ttn/build/GNU/T/exchange'
make[2]: Leaving directory '/home/ttn/build/GNU/T/exchange'
Making check in contrib
make[2]: Entering directory '/home/ttn/build/GNU/T/exchange/contrib'
Making check in .
make[3]: Entering directory '/home/ttn/build/GNU/T/exchange/contrib'
make[3]: Nothing to be done for 'check-am'.
make[3]: Leaving directory '/home/ttn/build/GNU/T/exchange/contrib'
make[2]: Leaving directory '/home/ttn/build/GNU/T/exchange/contrib'
Making check in src
make[2]: Entering directory '/home/ttn/build/GNU/T/exchange/src'
Making check in include
make[3]: Entering directory '/home/ttn/build/GNU/T/exchange/src/include'
make[3]: Nothing to be done for 'check'.
make[3]: Leaving directory '/home/ttn/build/GNU/T/exchange/src/include'
Making check in util
make[3]: Entering directory '/home/ttn/build/GNU/T/exchange/src/util'
make  test_age_restriction test_amount test_crypto test_helper_eddsa test_helper_rsa test_helper_cs test_payto test_url
make[4]: Entering directory '/home/ttn/build/GNU/T/exchange/src/util'
  CC       test_age_restriction.o
  CCLD     test_age_restriction
  CC       test_amount.o
  CCLD     test_amount
  CC       test_crypto.o
  CCLD     test_crypto
  CC       test_helper_eddsa.o
  CCLD     test_helper_eddsa
  CC       test_helper_rsa.o
  CCLD     test_helper_rsa
  CC       test_helper_cs.o
  CCLD     test_helper_cs
  CC       test_payto.o
  CCLD     test_payto
  CC       test_url.o
  CCLD     test_url
make[4]: Leaving directory '/home/ttn/build/GNU/T/exchange/src/util'
make  check-TESTS
make[4]: Entering directory '/home/ttn/build/GNU/T/exchange/src/util'
make[5]: Entering directory '/home/ttn/build/GNU/T/exchange/src/util'
PASS: test_age_restriction
PASS: test_amount
PASS: test_crypto
PASS: test_helper_eddsa
PASS: test_helper_rsa
PASS: test_helper_cs
PASS: test_payto
PASS: test_url
============================================================================
Testsuite summary for taler-exchange 0.8.5
============================================================================
# TOTAL: 8
# PASS:  8
# SKIP:  0
# XFAIL: 0
# FAIL:  0
# XPASS: 0
# ERROR: 0
============================================================================
make[5]: Leaving directory '/home/ttn/build/GNU/T/exchange/src/util'
make[4]: Leaving directory '/home/ttn/build/GNU/T/exchange/src/util'
make[3]: Leaving directory '/home/ttn/build/GNU/T/exchange/src/util'
Making check in json
make[3]: Entering directory '/home/ttn/build/GNU/T/exchange/src/json'
make  test_json test_json_wire
make[4]: Entering directory '/home/ttn/build/GNU/T/exchange/src/json'
  CC       test_json.o
  CCLD     test_json
  CC       test_json_wire.o
  CCLD     test_json_wire
make[4]: Leaving directory '/home/ttn/build/GNU/T/exchange/src/json'
make  check-TESTS
make[4]: Entering directory '/home/ttn/build/GNU/T/exchange/src/json'
make[5]: Entering directory '/home/ttn/build/GNU/T/exchange/src/json'
PASS: test_json
PASS: test_json_wire
============================================================================
Testsuite summary for taler-exchange 0.8.5
============================================================================
# TOTAL: 2
# PASS:  2
# SKIP:  0
# XFAIL: 0
# FAIL:  0
# XPASS: 0
# ERROR: 0
============================================================================
make[5]: Leaving directory '/home/ttn/build/GNU/T/exchange/src/json'
make[4]: Leaving directory '/home/ttn/build/GNU/T/exchange/src/json'
make[3]: Leaving directory '/home/ttn/build/GNU/T/exchange/src/json'
Making check in extensions
make[3]: Entering directory '/home/ttn/build/GNU/T/exchange/src/extensions'
make[3]: Nothing to be done for 'check'.
make[3]: Leaving directory '/home/ttn/build/GNU/T/exchange/src/extensions'
Making check in curl
make[3]: Entering directory '/home/ttn/build/GNU/T/exchange/src/curl'
make[3]: Nothing to be done for 'check'.
make[3]: Leaving directory '/home/ttn/build/GNU/T/exchange/src/curl'
Making check in pq
make[3]: Entering directory '/home/ttn/build/GNU/T/exchange/src/pq'
make  test_pq
make[4]: Entering directory '/home/ttn/build/GNU/T/exchange/src/pq'
  CC       test_pq.o
  CCLD     test_pq
make[4]: Leaving directory '/home/ttn/build/GNU/T/exchange/src/pq'
make  check-TESTS
make[4]: Entering directory '/home/ttn/build/GNU/T/exchange/src/pq'
make[5]: Entering directory '/home/ttn/build/GNU/T/exchange/src/pq'
PASS: test_pq
============================================================================
Testsuite summary for taler-exchange 0.8.5
============================================================================
# TOTAL: 1
# PASS:  1
# SKIP:  0
# XFAIL: 0
# FAIL:  0
# XPASS: 0
# ERROR: 0
============================================================================
make[5]: Leaving directory '/home/ttn/build/GNU/T/exchange/src/pq'
make[4]: Leaving directory '/home/ttn/build/GNU/T/exchange/src/pq'
make[3]: Leaving directory '/home/ttn/build/GNU/T/exchange/src/pq'
Making check in sq
make[3]: Entering directory '/home/ttn/build/GNU/T/exchange/src/sq'
make  test_sq
make[4]: Entering directory '/home/ttn/build/GNU/T/exchange/src/sq'
  CC       test_sq.o
  CCLD     test_sq
make[4]: Leaving directory '/home/ttn/build/GNU/T/exchange/src/sq'
make  check-TESTS
make[4]: Entering directory '/home/ttn/build/GNU/T/exchange/src/sq'
make[5]: Entering directory '/home/ttn/build/GNU/T/exchange/src/sq'
PASS: test_sq
============================================================================
Testsuite summary for taler-exchange 0.8.5
============================================================================
# TOTAL: 1
# PASS:  1
# SKIP:  0
# XFAIL: 0
# FAIL:  0
# XPASS: 0
# ERROR: 0
============================================================================
make[5]: Leaving directory '/home/ttn/build/GNU/T/exchange/src/sq'
make[4]: Leaving directory '/home/ttn/build/GNU/T/exchange/src/sq'
make[3]: Leaving directory '/home/ttn/build/GNU/T/exchange/src/sq'
Making check in mhd
make[3]: Entering directory '/home/ttn/build/GNU/T/exchange/src/mhd'
make[3]: Nothing to be done for 'check'.
make[3]: Leaving directory '/home/ttn/build/GNU/T/exchange/src/mhd'
Making check in bank-lib
make[3]: Entering directory '/home/ttn/build/GNU/T/exchange/src/bank-lib'
make  test_bank.sh
make[4]: Entering directory '/home/ttn/build/GNU/T/exchange/src/bank-lib'
make[4]: Nothing to be done for 'test_bank.sh'.
make[4]: Leaving directory '/home/ttn/build/GNU/T/exchange/src/bank-lib'
make  check-TESTS
make[4]: Entering directory '/home/ttn/build/GNU/T/exchange/src/bank-lib'
make[5]: Entering directory '/home/ttn/build/GNU/T/exchange/src/bank-lib'
PASS: test_bank.sh
============================================================================
Testsuite summary for taler-exchange 0.8.5
============================================================================
# TOTAL: 1
# PASS:  1
# SKIP:  0
# XFAIL: 0
# FAIL:  0
# XPASS: 0
# ERROR: 0
============================================================================
make[5]: Leaving directory '/home/ttn/build/GNU/T/exchange/src/bank-lib'
make[4]: Leaving directory '/home/ttn/build/GNU/T/exchange/src/bank-lib'
make[3]: Leaving directory '/home/ttn/build/GNU/T/exchange/src/bank-lib'
Making check in exchangedb
make[3]: Entering directory '/home/ttn/build/GNU/T/exchange/src/exchangedb'
make  check-am
make[4]: Entering directory '/home/ttn/build/GNU/T/exchange/src/exchangedb'
make  test-exchangedb-postgres bench-db-postgres
make[5]: Entering directory '/home/ttn/build/GNU/T/exchange/src/exchangedb'
  CC       test_exchangedb.o
  CCLD     test-exchangedb-postgres
  CC       bench_db.o
  CCLD     bench-db-postgres
make[5]: Leaving directory '/home/ttn/build/GNU/T/exchange/src/exchangedb'
make  check-TESTS
make[5]: Entering directory '/home/ttn/build/GNU/T/exchange/src/exchangedb'
make[6]: Entering directory '/home/ttn/build/GNU/T/exchange/src/exchangedb'
PASS: test-exchangedb-postgres
============================================================================
Testsuite summary for taler-exchange 0.8.5
============================================================================
# TOTAL: 1
# PASS:  1
# SKIP:  0
# XFAIL: 0
# FAIL:  0
# XPASS: 0
# ERROR: 0
============================================================================
make[6]: Leaving directory '/home/ttn/build/GNU/T/exchange/src/exchangedb'
make[5]: Leaving directory '/home/ttn/build/GNU/T/exchange/src/exchangedb'
make[4]: Leaving directory '/home/ttn/build/GNU/T/exchange/src/exchangedb'
make[3]: Leaving directory '/home/ttn/build/GNU/T/exchange/src/exchangedb'
Making check in exchange
make[3]: Entering directory '/home/ttn/build/GNU/T/exchange/src/exchange'
make  test_taler_exchange_httpd.sh 
make[4]: Entering directory '/home/ttn/build/GNU/T/exchange/src/exchange'
make[4]: Nothing to be done for 'test_taler_exchange_httpd.sh'.
make[4]: Leaving directory '/home/ttn/build/GNU/T/exchange/src/exchange'
make  check-TESTS
make[4]: Entering directory '/home/ttn/build/GNU/T/exchange/src/exchange'
make[5]: Entering directory '/home/ttn/build/GNU/T/exchange/src/exchange'
PASS: test_taler_exchange_httpd.sh
============================================================================
Testsuite summary for taler-exchange 0.8.5
============================================================================
# TOTAL: 1
# PASS:  1
# SKIP:  0
# XFAIL: 0
# FAIL:  0
# XPASS: 0
# ERROR: 0
============================================================================
make[5]: Leaving directory '/home/ttn/build/GNU/T/exchange/src/exchange'
make[4]: Leaving directory '/home/ttn/build/GNU/T/exchange/src/exchange'
make[3]: Leaving directory '/home/ttn/build/GNU/T/exchange/src/exchange'
Making check in auditordb
make[3]: Entering directory '/home/ttn/build/GNU/T/exchange/src/auditordb'
make  test-auditordb-postgres
make[4]: Entering directory '/home/ttn/build/GNU/T/exchange/src/auditordb'
  CC       test_auditordb.o
  CCLD     test-auditordb-postgres
make[4]: Leaving directory '/home/ttn/build/GNU/T/exchange/src/auditordb'
make  check-TESTS
make[4]: Entering directory '/home/ttn/build/GNU/T/exchange/src/auditordb'
make[5]: Entering directory '/home/ttn/build/GNU/T/exchange/src/auditordb'
PASS: test-auditordb-postgres
============================================================================
Testsuite summary for taler-exchange 0.8.5
============================================================================
# TOTAL: 1
# PASS:  1
# SKIP:  0
# XFAIL: 0
# FAIL:  0
# XPASS: 0
# ERROR: 0
============================================================================
make[5]: Leaving directory '/home/ttn/build/GNU/T/exchange/src/auditordb'
make[4]: Leaving directory '/home/ttn/build/GNU/T/exchange/src/auditordb'
make[3]: Leaving directory '/home/ttn/build/GNU/T/exchange/src/auditordb'
Making check in auditor
make[3]: Entering directory '/home/ttn/build/GNU/T/exchange/src/auditor'
make  test-auditor.sh test-revocation.sh test-sync.sh
make[4]: Entering directory '/home/ttn/build/GNU/T/exchange/src/auditor'
make[4]: Nothing to be done for 'test-auditor.sh'.
make[4]: Nothing to be done for 'test-revocation.sh'.
make[4]: Nothing to be done for 'test-sync.sh'.
make[4]: Leaving directory '/home/ttn/build/GNU/T/exchange/src/auditor'
make  check-TESTS
make[4]: Entering directory '/home/ttn/build/GNU/T/exchange/src/auditor'
make[5]: Entering directory '/home/ttn/build/GNU/T/exchange/src/auditor'
SKIP: test-auditor.sh
SKIP: test-revocation.sh
PASS: test-sync.sh
============================================================================
Testsuite summary for taler-exchange 0.8.5
============================================================================
# TOTAL: 3
# PASS:  1
# SKIP:  2
# XFAIL: 0
# FAIL:  0
# XPASS: 0
# ERROR: 0
============================================================================
make[5]: Leaving directory '/home/ttn/build/GNU/T/exchange/src/auditor'
make[4]: Leaving directory '/home/ttn/build/GNU/T/exchange/src/auditor'
make[3]: Leaving directory '/home/ttn/build/GNU/T/exchange/src/auditor'
Making check in lib
make[3]: Entering directory '/home/ttn/build/GNU/T/exchange/src/lib'
make[3]: Nothing to be done for 'check'.
make[3]: Leaving directory '/home/ttn/build/GNU/T/exchange/src/lib'
Making check in exchange-tools
make[3]: Entering directory '/home/ttn/build/GNU/T/exchange/src/exchange-tools'
make[3]: Nothing to be done for 'check'.
make[3]: Leaving directory '/home/ttn/build/GNU/T/exchange/src/exchange-tools'
Making check in testing
make[3]: Entering directory '/home/ttn/build/GNU/T/exchange/src/testing'
make  test_auditor_api_cs test_auditor_api_rsa test_auditor_api_version_rsa test_auditor_api_version_cs test_bank_api_with_fakebank test_bank_api_with_pybank test_bank_api_with_nexus test_exchange_api_cs test_exchange_api_rsa test_exchange_api_keys_cherry_picking_cs test_exchange_api_keys_cherry_picking_rsa test_exchange_api_revocation_cs test_exchange_api_revocation_rsa test_exchange_api_overlapping_keys_bug_cs test_exchange_api_overlapping_keys_bug_rsa test_exchange_management_api_cs test_exchange_management_api_rsa test_kyc_api test_taler_exchange_aggregator-postgres test_taler_exchange_wirewatch-postgres 
make[4]: Entering directory '/home/ttn/build/GNU/T/exchange/src/testing'
  CC       test_auditor_api.o
  CCLD     test_auditor_api_cs
  CCLD     test_auditor_api_rsa
  CC       test_auditor_api_version.o
  CCLD     test_auditor_api_version_rsa
  CCLD     test_auditor_api_version_cs
  CC       test_bank_api.o
  CCLD     test_bank_api_with_fakebank
  CCLD     test_bank_api_with_pybank
  CCLD     test_bank_api_with_nexus
  CC       test_exchange_api.o
  CCLD     test_exchange_api_cs
  CCLD     test_exchange_api_rsa
  CC       test_exchange_api_keys_cherry_picking.o
  CCLD     test_exchange_api_keys_cherry_picking_cs
  CCLD     test_exchange_api_keys_cherry_picking_rsa
  CC       test_exchange_api_revocation.o
  CCLD     test_exchange_api_revocation_cs
  CCLD     test_exchange_api_revocation_rsa
  CC       test_exchange_api_overlapping_keys_bug.o
  CCLD     test_exchange_api_overlapping_keys_bug_cs
  CCLD     test_exchange_api_overlapping_keys_bug_rsa
  CC       test_exchange_management_api.o
  CCLD     test_exchange_management_api_cs
  CCLD     test_exchange_management_api_rsa
  CC       test_kyc_api.o
  CCLD     test_kyc_api
  CC       test_taler_exchange_aggregator.o
  CCLD     test_taler_exchange_aggregator-postgres
  CC       test_taler_exchange_wirewatch.o
  CCLD     test_taler_exchange_wirewatch-postgres
make[4]: Leaving directory '/home/ttn/build/GNU/T/exchange/src/testing'
make  check-TESTS
make[4]: Entering directory '/home/ttn/build/GNU/T/exchange/src/testing'
make[5]: Entering directory '/home/ttn/build/GNU/T/exchange/src/testing'
FAIL: test_auditor_api_cs
FAIL: test_auditor_api_rsa
PASS: test_auditor_api_version_rsa
PASS: test_auditor_api_version_cs
SKIP: test_bank_api_with_fakebank
SKIP: test_bank_api_with_pybank
SKIP: test_bank_api_with_nexus
FAIL: test_exchange_api_cs
FAIL: test_exchange_api_rsa
FAIL: test_exchange_api_keys_cherry_picking_cs
FAIL: test_exchange_api_keys_cherry_picking_rsa
FAIL: test_exchange_api_revocation_cs
FAIL: test_exchange_api_revocation_rsa
FAIL: test_exchange_api_overlapping_keys_bug_cs
FAIL: test_exchange_api_overlapping_keys_bug_rsa
FAIL: test_exchange_management_api_cs
FAIL: test_exchange_management_api_rsa
FAIL: test_kyc_api
FAIL: test_taler_exchange_aggregator-postgres
FAIL: test_taler_exchange_wirewatch-postgres
============================================================================
Testsuite summary for taler-exchange 0.8.5
============================================================================
# TOTAL: 20
# PASS:  2
# SKIP:  3
# XFAIL: 0
# FAIL:  15
# XPASS: 0
# ERROR: 0
============================================================================
See src/testing/test-suite.log
Please report to taler-bug@gnunet.org
============================================================================
make[5]: *** [Makefile:1919: test-suite.log] Error 1
make[5]: Leaving directory '/home/ttn/build/GNU/T/exchange/src/testing'
make[4]: *** [Makefile:2027: check-TESTS] Error 2
make[4]: Leaving directory '/home/ttn/build/GNU/T/exchange/src/testing'
make[3]: *** [Makefile:2262: check-am] Error 2
make[3]: Leaving directory '/home/ttn/build/GNU/T/exchange/src/testing'
make[2]: *** [Makefile:522: check-recursive] Error 1
make[2]: Leaving directory '/home/ttn/build/GNU/T/exchange/src'
make[1]: *** [Makefile:506: check-recursive] Error 1
make[1]: Leaving directory '/home/ttn/build/GNU/T/exchange'
make: *** [Makefile:798: check] Error 2
.ttn.exchange-make-check.log (17,129 bytes)   
test-suite.log (37,879 bytes)   
======================================================
   taler-exchange 0.8.5: src/testing/test-suite.log
======================================================

# TOTAL: 20
# PASS:  2
# SKIP:  3
# XFAIL: 0
# FAIL:  15
# XPASS: 0
# ERROR: 0

.. contents:: :depth: 2

FAIL: test_auditor_api_cs
=========================

2022-04-03T01:17:52.660495+0000 /home/ttn/build/GNU/T/exchange/src/testing/.libs/test_auditor_api_cs-50557 INFO Using fakebank http://localhost:8082/2/ on port 8082
2022-04-03T01:17:52.660696+0000 /home/ttn/build/GNU/T/exchange/src/testing/.libs/test_auditor_api_cs-50557 INFO exchange payto: payto://x-taler-bank/localhost/2
2022-04-03T01:17:52.660707+0000 /home/ttn/build/GNU/T/exchange/src/testing/.libs/test_auditor_api_cs-50557 INFO user42_payto: payto://x-taler-bank/localhost/42
2022-04-03T01:17:52.660712+0000 /home/ttn/build/GNU/T/exchange/src/testing/.libs/test_auditor_api_cs-50557 INFO user43_payto: payto://x-taler-bank/localhost/43
psql:/home/ttn/te/share/taler/sql/exchange/drop0001.sql:108: NOTICE:  drop cascades to constraint auditor_denom_sigs_auditor_uuid_fkey on table auditor_denom_sigs
psql:/home/ttn/te/share/taler/sql/exchange/drop0001.sql:110: NOTICE:  drop cascades to constraint signkey_revocations_esk_serial_fkey on table signkey_revocations
psql:/home/ttn/te/share/taler/sql/exchange/drop0001.sql:130: NOTICE:  drop cascades to constraint purse_deposits_coin_pub_fkey on table purse_deposits
psql:/home/ttn/te/share/taler/sql/exchange/drop0001.sql:135: NOTICE:  drop cascades to 2 other objects
DETAIL:  drop cascades to constraint history_requests_reserve_pub_fkey on table history_requests
drop cascades to constraint close_requests_reserve_pub_fkey on table close_requests
psql:/home/ttn/te/share/taler/sql/exchange/drop0001.sql:143: NOTICE:  drop cascades to 4 other objects
DETAIL:  drop cascades to constraint purse_merges_partner_serial_id_fkey on table purse_merges
drop cascades to constraint purse_deposits_partner_serial_id_fkey on table purse_deposits
drop cascades to constraint wads_out_partner_serial_id_fkey on table wads_out
drop cascades to constraint partner_accounts_partner_serial_id_fkey on table partner_accounts
psql:/home/ttn/te/share/taler/sql/auditor/drop0001.sql:27: NOTICE:  table "auditor_predicted_result" does not exist, skipping
psql:/home/ttn/te/share/taler/sql/auditor/drop0001.sql:28: NOTICE:  table "auditor_historic_denomination_revenue" does not exist, skipping
psql:/home/ttn/te/share/taler/sql/auditor/drop0001.sql:29: NOTICE:  table "auditor_balance_summary" does not exist, skipping
psql:/home/ttn/te/share/taler/sql/auditor/drop0001.sql:30: NOTICE:  table "auditor_denomination_pending" does not exist, skipping
psql:/home/ttn/te/share/taler/sql/auditor/drop0001.sql:31: NOTICE:  table "auditor_reserve_balance" does not exist, skipping
psql:/home/ttn/te/share/taler/sql/auditor/drop0001.sql:32: NOTICE:  table "auditor_wire_fee_balance" does not exist, skipping
psql:/home/ttn/te/share/taler/sql/auditor/drop0001.sql:33: NOTICE:  table "auditor_reserves" does not exist, skipping
psql:/home/ttn/te/share/taler/sql/auditor/drop0001.sql:34: NOTICE:  table "auditor_progress_reserve" does not exist, skipping
psql:/home/ttn/te/share/taler/sql/auditor/drop0001.sql:35: NOTICE:  table "auditor_progress_aggregation" does not exist, skipping
psql:/home/ttn/te/share/taler/sql/auditor/drop0001.sql:36: NOTICE:  table "auditor_progress_deposit_confirmation" does not exist, skipping
psql:/home/ttn/te/share/taler/sql/auditor/drop0001.sql:37: NOTICE:  table "auditor_progress_coin" does not exist, skipping
psql:/home/ttn/te/share/taler/sql/auditor/drop0001.sql:38: NOTICE:  table "auditor_exchange_signkeys" does not exist, skipping
psql:/home/ttn/te/share/taler/sql/auditor/drop0001.sql:39: NOTICE:  table "wire_auditor_progress" does not exist, skipping
psql:/home/ttn/te/share/taler/sql/auditor/drop0001.sql:40: NOTICE:  table "wire_auditor_account_progress" does not exist, skipping
psql:/home/ttn/te/share/taler/sql/auditor/drop0001.sql:41: NOTICE:  table "auditor_historic_reserve_summary" does not exist, skipping
psql:/home/ttn/te/share/taler/sql/auditor/drop0001.sql:42: NOTICE:  table "auditor_denominations" does not exist, skipping
psql:/home/ttn/te/share/taler/sql/auditor/drop0001.sql:43: NOTICE:  table "deposit_confirmations" does not exist, skipping
psql:/home/ttn/te/share/taler/sql/auditor/drop0001.sql:44: NOTICE:  table "auditor_exchanges" does not exist, skipping
psql:/home/ttn/te/share/taler/sql/auditor/drop0001.sql:47: ERROR:  Patch auditor-0001 is not installed, so it can't be uninstalled!
CONTEXT:  PL/pgSQL function _v.unregister_patch(text) line 17 at RAISE
2022-04-03T01:17:53.845243+0000 taler-auditor-dbinit-50593 WARNING Could not run PSQL on file /home/ttn/te/share/taler//sql/auditor/drop0001.sql: psql exit code was 3
2022-04-03T01:17:53.845353+0000 taler-auditor-dbinit-50593 WARNING Failed to load SQL statements from `/home/ttn/te/share/taler//sql/auditor/drop*'
2022-04-03T01:17:53.845394+0000 taler-auditor-dbinit-50593 WARNING Failed to reset database
Waiting for `taler-auditor-httpd' to be ready at http://localhost:8083/
.
2022-04-03T01:17:55.086628+0000 /home/ttn/build/GNU/T/exchange/src/testing/.libs/test_auditor_api_cs-50557 WARNING Required port 8081 not available, skipping.
FAIL test_auditor_api_cs (exit status: 2)

FAIL: test_auditor_api_rsa
==========================

2022-04-03T01:17:55.138369+0000 /home/ttn/build/GNU/T/exchange/src/testing/.libs/test_auditor_api_rsa-50626 INFO Using fakebank http://localhost:8082/2/ on port 8082
2022-04-03T01:17:55.138954+0000 /home/ttn/build/GNU/T/exchange/src/testing/.libs/test_auditor_api_rsa-50626 INFO exchange payto: payto://x-taler-bank/localhost/2
2022-04-03T01:17:55.138979+0000 /home/ttn/build/GNU/T/exchange/src/testing/.libs/test_auditor_api_rsa-50626 INFO user42_payto: payto://x-taler-bank/localhost/42
2022-04-03T01:17:55.138988+0000 /home/ttn/build/GNU/T/exchange/src/testing/.libs/test_auditor_api_rsa-50626 INFO user43_payto: payto://x-taler-bank/localhost/43
psql:/home/ttn/te/share/taler/sql/exchange/drop0001.sql:108: NOTICE:  drop cascades to constraint auditor_denom_sigs_auditor_uuid_fkey on table auditor_denom_sigs
psql:/home/ttn/te/share/taler/sql/exchange/drop0001.sql:110: NOTICE:  drop cascades to constraint signkey_revocations_esk_serial_fkey on table signkey_revocations
psql:/home/ttn/te/share/taler/sql/exchange/drop0001.sql:130: NOTICE:  drop cascades to constraint purse_deposits_coin_pub_fkey on table purse_deposits
psql:/home/ttn/te/share/taler/sql/exchange/drop0001.sql:135: NOTICE:  drop cascades to 2 other objects
DETAIL:  drop cascades to constraint history_requests_reserve_pub_fkey on table history_requests
drop cascades to constraint close_requests_reserve_pub_fkey on table close_requests
psql:/home/ttn/te/share/taler/sql/exchange/drop0001.sql:143: NOTICE:  drop cascades to 4 other objects
DETAIL:  drop cascades to constraint purse_merges_partner_serial_id_fkey on table purse_merges
drop cascades to constraint purse_deposits_partner_serial_id_fkey on table purse_deposits
drop cascades to constraint wads_out_partner_serial_id_fkey on table wads_out
drop cascades to constraint partner_accounts_partner_serial_id_fkey on table partner_accounts
psql:/home/ttn/te/share/taler/sql/auditor/drop0001.sql:42: NOTICE:  table "auditor_denominations" does not exist, skipping
Waiting for `taler-auditor-httpd' to be ready at http://localhost:8083/
.
2022-04-03T01:17:57.816778+0000 /home/ttn/build/GNU/T/exchange/src/testing/.libs/test_auditor_api_rsa-50626 WARNING Required port 8081 not available, skipping.
FAIL test_auditor_api_rsa (exit status: 2)

SKIP: test_bank_api_with_fakebank
=================================

2022-04-03T01:18:18.105020+0000 test-bank-api-50777 INFO Using fakebank http://localhost:8081/2/ on port 8081
2022-04-03T01:18:18.105342+0000 test-bank-api-50777 WARNING Port 8081 not available.
2022-04-03T01:18:18.105362+0000 test-bank-api-50777 ERROR Assertion failed at test_bank_api.c:189.
SKIP test_bank_api_with_fakebank (exit status: 77)

SKIP: test_bank_api_with_pybank
===============================

Required port 8081 not available, skipping.
2022-04-03T01:18:18.142566+0000 test-bank-api-50796 ERROR Assertion failed at testing_api_helpers_bank.c:481.
2022-04-03T01:18:18.142640+0000 test-bank-api-50796 ERROR Assertion failed at test_bank_api.c:204.
SKIP test_bank_api_with_pybank (exit status: 77)

SKIP: test_bank_api_with_nexus
==============================

2022-04-03T01:18:18.167629+0000 test-bank-api-50815 INFO Relying on nexus http://localhost:5001/facades/my-facade/taler/ on port 5001
2022-04-03T01:18:18.167687+0000 test-bank-api-50815 INFO exchange payto: payto://iban/BIC/ES9121000418450200051332?receiver-name=Exchange
2022-04-03T01:18:18.167695+0000 test-bank-api-50815 INFO user42_payto: payto://iban/BIC/FR7630006000011234567890189?receiver-name=User42
2022-04-03T01:18:18.167698+0000 test-bank-api-50815 INFO user42_payto: payto://iban/BIC/GB33BUKB20201555555555?receiver-name=User43
2022-04-03T01:18:18.168223+0000 util-os-installation-50815 INFO Could not find binary `libeufin-nexus' in PATH!
2022-04-03T01:18:18.168254+0000 test-bank-api-50815 WARNING `exec' failed on file `libeufin-nexus' at testing_api_helpers_bank.c:106 with error: No such file or directory
SKIP test_bank_api_with_nexus (exit status: 77)

FAIL: test_exchange_api_cs
==========================

2022-04-03T01:18:18.187712+0000 /home/ttn/build/GNU/T/exchange/src/testing/.libs/test_exchange_api_cs-50837 INFO Using fakebank http://localhost:9081/2/ on port 9081
2022-04-03T01:18:18.187981+0000 /home/ttn/build/GNU/T/exchange/src/testing/.libs/test_exchange_api_cs-50837 INFO exchange payto: payto://x-taler-bank/localhost/2
2022-04-03T01:18:18.188010+0000 /home/ttn/build/GNU/T/exchange/src/testing/.libs/test_exchange_api_cs-50837 INFO user42_payto: payto://x-taler-bank/localhost/42
2022-04-03T01:18:18.188013+0000 /home/ttn/build/GNU/T/exchange/src/testing/.libs/test_exchange_api_cs-50837 INFO user43_payto: payto://x-taler-bank/localhost/43
psql:/home/ttn/te/share/taler/sql/exchange/drop0001.sql:108: NOTICE:  drop cascades to constraint auditor_denom_sigs_auditor_uuid_fkey on table auditor_denom_sigs
psql:/home/ttn/te/share/taler/sql/exchange/drop0001.sql:110: NOTICE:  drop cascades to constraint signkey_revocations_esk_serial_fkey on table signkey_revocations
psql:/home/ttn/te/share/taler/sql/exchange/drop0001.sql:130: NOTICE:  drop cascades to constraint purse_deposits_coin_pub_fkey on table purse_deposits
psql:/home/ttn/te/share/taler/sql/exchange/drop0001.sql:135: NOTICE:  drop cascades to 2 other objects
DETAIL:  drop cascades to constraint history_requests_reserve_pub_fkey on table history_requests
drop cascades to constraint close_requests_reserve_pub_fkey on table close_requests
psql:/home/ttn/te/share/taler/sql/exchange/drop0001.sql:143: NOTICE:  drop cascades to 4 other objects
DETAIL:  drop cascades to constraint purse_merges_partner_serial_id_fkey on table purse_merges
drop cascades to constraint purse_deposits_partner_serial_id_fkey on table purse_deposits
drop cascades to constraint wads_out_partner_serial_id_fkey on table wads_out
drop cascades to constraint partner_accounts_partner_serial_id_fkey on table partner_accounts
psql:/home/ttn/te/share/taler/sql/auditor/drop0001.sql:42: NOTICE:  table "auditor_denominations" does not exist, skipping
2022-04-03T01:18:20.040157+0000 /home/ttn/build/GNU/T/exchange/src/testing/.libs/test_exchange_api_cs-50837 INFO setting age mask to 255501 with #groups: 7
2022-04-03T01:18:20.065907+0000 /home/ttn/build/GNU/T/exchange/src/testing/.libs/test_exchange_api_cs-50837 WARNING Required port 8081 not available, skipping.
FAIL test_exchange_api_cs (exit status: 2)

FAIL: test_exchange_api_rsa
===========================

2022-04-03T01:18:20.091943+0000 /home/ttn/build/GNU/T/exchange/src/testing/.libs/test_exchange_api_rsa-50902 INFO Using fakebank http://localhost:9081/2/ on port 9081
2022-04-03T01:18:20.092161+0000 /home/ttn/build/GNU/T/exchange/src/testing/.libs/test_exchange_api_rsa-50902 INFO exchange payto: payto://x-taler-bank/localhost/2
2022-04-03T01:18:20.092172+0000 /home/ttn/build/GNU/T/exchange/src/testing/.libs/test_exchange_api_rsa-50902 INFO user42_payto: payto://x-taler-bank/localhost/42
2022-04-03T01:18:20.092178+0000 /home/ttn/build/GNU/T/exchange/src/testing/.libs/test_exchange_api_rsa-50902 INFO user43_payto: payto://x-taler-bank/localhost/43
psql:/home/ttn/te/share/taler/sql/exchange/drop0001.sql:108: NOTICE:  drop cascades to constraint auditor_denom_sigs_auditor_uuid_fkey on table auditor_denom_sigs
psql:/home/ttn/te/share/taler/sql/exchange/drop0001.sql:110: NOTICE:  drop cascades to constraint signkey_revocations_esk_serial_fkey on table signkey_revocations
psql:/home/ttn/te/share/taler/sql/exchange/drop0001.sql:130: NOTICE:  drop cascades to constraint purse_deposits_coin_pub_fkey on table purse_deposits
psql:/home/ttn/te/share/taler/sql/exchange/drop0001.sql:135: NOTICE:  drop cascades to 2 other objects
DETAIL:  drop cascades to constraint history_requests_reserve_pub_fkey on table history_requests
drop cascades to constraint close_requests_reserve_pub_fkey on table close_requests
psql:/home/ttn/te/share/taler/sql/exchange/drop0001.sql:143: NOTICE:  drop cascades to 4 other objects
DETAIL:  drop cascades to constraint purse_merges_partner_serial_id_fkey on table purse_merges
drop cascades to constraint purse_deposits_partner_serial_id_fkey on table purse_deposits
drop cascades to constraint wads_out_partner_serial_id_fkey on table wads_out
drop cascades to constraint partner_accounts_partner_serial_id_fkey on table partner_accounts
psql:/home/ttn/te/share/taler/sql/auditor/drop0001.sql:42: NOTICE:  table "auditor_denominations" does not exist, skipping
2022-04-03T01:18:21.834012+0000 /home/ttn/build/GNU/T/exchange/src/testing/.libs/test_exchange_api_rsa-50902 INFO setting age mask to 255501 with #groups: 7
2022-04-03T01:18:21.861636+0000 /home/ttn/build/GNU/T/exchange/src/testing/.libs/test_exchange_api_rsa-50902 WARNING Required port 8081 not available, skipping.
FAIL test_exchange_api_rsa (exit status: 2)

FAIL: test_exchange_api_keys_cherry_picking_cs
==============================================

psql:/home/ttn/te/share/taler/sql/exchange/drop0001.sql:108: NOTICE:  drop cascades to constraint auditor_denom_sigs_auditor_uuid_fkey on table auditor_denom_sigs
psql:/home/ttn/te/share/taler/sql/exchange/drop0001.sql:110: NOTICE:  drop cascades to constraint signkey_revocations_esk_serial_fkey on table signkey_revocations
psql:/home/ttn/te/share/taler/sql/exchange/drop0001.sql:130: NOTICE:  drop cascades to constraint purse_deposits_coin_pub_fkey on table purse_deposits
psql:/home/ttn/te/share/taler/sql/exchange/drop0001.sql:135: NOTICE:  drop cascades to 2 other objects
DETAIL:  drop cascades to constraint history_requests_reserve_pub_fkey on table history_requests
drop cascades to constraint close_requests_reserve_pub_fkey on table close_requests
psql:/home/ttn/te/share/taler/sql/exchange/drop0001.sql:143: NOTICE:  drop cascades to 4 other objects
DETAIL:  drop cascades to constraint purse_merges_partner_serial_id_fkey on table purse_merges
drop cascades to constraint purse_deposits_partner_serial_id_fkey on table purse_deposits
drop cascades to constraint wads_out_partner_serial_id_fkey on table wads_out
drop cascades to constraint partner_accounts_partner_serial_id_fkey on table partner_accounts
psql:/home/ttn/te/share/taler/sql/auditor/drop0001.sql:42: NOTICE:  table "auditor_denominations" does not exist, skipping
2022-04-03T01:18:23.752440+0000 /home/ttn/build/GNU/T/exchange/src/testing/.libs/test_exchange_api_keys_cherry_picking_cs-50967 WARNING Required port 8081 not available, skipping.
FAIL test_exchange_api_keys_cherry_picking_cs (exit status: 1)

FAIL: test_exchange_api_keys_cherry_picking_rsa
===============================================

psql:/home/ttn/te/share/taler/sql/exchange/drop0001.sql:108: NOTICE:  drop cascades to constraint auditor_denom_sigs_auditor_uuid_fkey on table auditor_denom_sigs
psql:/home/ttn/te/share/taler/sql/exchange/drop0001.sql:110: NOTICE:  drop cascades to constraint signkey_revocations_esk_serial_fkey on table signkey_revocations
psql:/home/ttn/te/share/taler/sql/exchange/drop0001.sql:130: NOTICE:  drop cascades to constraint purse_deposits_coin_pub_fkey on table purse_deposits
psql:/home/ttn/te/share/taler/sql/exchange/drop0001.sql:135: NOTICE:  drop cascades to 2 other objects
DETAIL:  drop cascades to constraint history_requests_reserve_pub_fkey on table history_requests
drop cascades to constraint close_requests_reserve_pub_fkey on table close_requests
psql:/home/ttn/te/share/taler/sql/exchange/drop0001.sql:143: NOTICE:  drop cascades to 4 other objects
DETAIL:  drop cascades to constraint purse_merges_partner_serial_id_fkey on table purse_merges
drop cascades to constraint purse_deposits_partner_serial_id_fkey on table purse_deposits
drop cascades to constraint wads_out_partner_serial_id_fkey on table wads_out
drop cascades to constraint partner_accounts_partner_serial_id_fkey on table partner_accounts
psql:/home/ttn/te/share/taler/sql/auditor/drop0001.sql:42: NOTICE:  table "auditor_denominations" does not exist, skipping
2022-04-03T01:18:25.500424+0000 /home/ttn/build/GNU/T/exchange/src/testing/.libs/test_exchange_api_keys_cherry_picking_rsa-51032 WARNING Required port 8081 not available, skipping.
FAIL test_exchange_api_keys_cherry_picking_rsa (exit status: 1)

FAIL: test_exchange_api_revocation_cs
=====================================

2022-04-03T01:18:25.526482+0000 /home/ttn/build/GNU/T/exchange/src/testing/.libs/test_exchange_api_revocation_cs-51097 INFO Using fakebank http://localhost:9081/2/ on port 9081
2022-04-03T01:18:25.526778+0000 /home/ttn/build/GNU/T/exchange/src/testing/.libs/test_exchange_api_revocation_cs-51097 INFO exchange payto: payto://x-taler-bank/localhost/2
2022-04-03T01:18:25.526790+0000 /home/ttn/build/GNU/T/exchange/src/testing/.libs/test_exchange_api_revocation_cs-51097 INFO user42_payto: payto://x-taler-bank/localhost/42
2022-04-03T01:18:25.526795+0000 /home/ttn/build/GNU/T/exchange/src/testing/.libs/test_exchange_api_revocation_cs-51097 INFO user43_payto: payto://x-taler-bank/localhost/43
psql:/home/ttn/te/share/taler/sql/exchange/drop0001.sql:108: NOTICE:  drop cascades to constraint auditor_denom_sigs_auditor_uuid_fkey on table auditor_denom_sigs
psql:/home/ttn/te/share/taler/sql/exchange/drop0001.sql:110: NOTICE:  drop cascades to constraint signkey_revocations_esk_serial_fkey on table signkey_revocations
psql:/home/ttn/te/share/taler/sql/exchange/drop0001.sql:130: NOTICE:  drop cascades to constraint purse_deposits_coin_pub_fkey on table purse_deposits
psql:/home/ttn/te/share/taler/sql/exchange/drop0001.sql:135: NOTICE:  drop cascades to 2 other objects
DETAIL:  drop cascades to constraint history_requests_reserve_pub_fkey on table history_requests
drop cascades to constraint close_requests_reserve_pub_fkey on table close_requests
psql:/home/ttn/te/share/taler/sql/exchange/drop0001.sql:143: NOTICE:  drop cascades to 4 other objects
DETAIL:  drop cascades to constraint purse_merges_partner_serial_id_fkey on table purse_merges
drop cascades to constraint purse_deposits_partner_serial_id_fkey on table purse_deposits
drop cascades to constraint wads_out_partner_serial_id_fkey on table wads_out
drop cascades to constraint partner_accounts_partner_serial_id_fkey on table partner_accounts
psql:/home/ttn/te/share/taler/sql/auditor/drop0001.sql:42: NOTICE:  table "auditor_denominations" does not exist, skipping
2022-04-03T01:18:26.666623+0000 /home/ttn/build/GNU/T/exchange/src/testing/.libs/test_exchange_api_revocation_cs-51097 ERROR Unsupported extension `age_restriction` (section [exchange-extension-age_restriction]).
2022-04-03T01:18:26.694402+0000 /home/ttn/build/GNU/T/exchange/src/testing/.libs/test_exchange_api_revocation_cs-51097 WARNING Required port 8081 not available, skipping.
FAIL test_exchange_api_revocation_cs (exit status: 1)

FAIL: test_exchange_api_revocation_rsa
======================================

2022-04-03T01:18:26.727649+0000 /home/ttn/build/GNU/T/exchange/src/testing/.libs/test_exchange_api_revocation_rsa-51162 INFO Using fakebank http://localhost:9081/2/ on port 9081
2022-04-03T01:18:26.727800+0000 /home/ttn/build/GNU/T/exchange/src/testing/.libs/test_exchange_api_revocation_rsa-51162 INFO exchange payto: payto://x-taler-bank/localhost/2
2022-04-03T01:18:26.727806+0000 /home/ttn/build/GNU/T/exchange/src/testing/.libs/test_exchange_api_revocation_rsa-51162 INFO user42_payto: payto://x-taler-bank/localhost/42
2022-04-03T01:18:26.727809+0000 /home/ttn/build/GNU/T/exchange/src/testing/.libs/test_exchange_api_revocation_rsa-51162 INFO user43_payto: payto://x-taler-bank/localhost/43
psql:/home/ttn/te/share/taler/sql/exchange/drop0001.sql:108: NOTICE:  drop cascades to constraint auditor_denom_sigs_auditor_uuid_fkey on table auditor_denom_sigs
psql:/home/ttn/te/share/taler/sql/exchange/drop0001.sql:110: NOTICE:  drop cascades to constraint signkey_revocations_esk_serial_fkey on table signkey_revocations
psql:/home/ttn/te/share/taler/sql/exchange/drop0001.sql:130: NOTICE:  drop cascades to constraint purse_deposits_coin_pub_fkey on table purse_deposits
psql:/home/ttn/te/share/taler/sql/exchange/drop0001.sql:135: NOTICE:  drop cascades to 2 other objects
DETAIL:  drop cascades to constraint history_requests_reserve_pub_fkey on table history_requests
drop cascades to constraint close_requests_reserve_pub_fkey on table close_requests
psql:/home/ttn/te/share/taler/sql/exchange/drop0001.sql:143: NOTICE:  drop cascades to 4 other objects
DETAIL:  drop cascades to constraint purse_merges_partner_serial_id_fkey on table purse_merges
drop cascades to constraint purse_deposits_partner_serial_id_fkey on table purse_deposits
drop cascades to constraint wads_out_partner_serial_id_fkey on table wads_out
drop cascades to constraint partner_accounts_partner_serial_id_fkey on table partner_accounts
psql:/home/ttn/te/share/taler/sql/auditor/drop0001.sql:42: NOTICE:  table "auditor_denominations" does not exist, skipping
2022-04-03T01:18:28.237498+0000 /home/ttn/build/GNU/T/exchange/src/testing/.libs/test_exchange_api_revocation_rsa-51162 ERROR Unsupported extension `age_restriction` (section [exchange-extension-age_restriction]).
2022-04-03T01:18:28.277224+0000 /home/ttn/build/GNU/T/exchange/src/testing/.libs/test_exchange_api_revocation_rsa-51162 WARNING Required port 8081 not available, skipping.
FAIL test_exchange_api_revocation_rsa (exit status: 1)

FAIL: test_exchange_api_overlapping_keys_bug_cs
===============================================

psql:/home/ttn/te/share/taler/sql/exchange/drop0001.sql:108: NOTICE:  drop cascades to constraint auditor_denom_sigs_auditor_uuid_fkey on table auditor_denom_sigs
psql:/home/ttn/te/share/taler/sql/exchange/drop0001.sql:110: NOTICE:  drop cascades to constraint signkey_revocations_esk_serial_fkey on table signkey_revocations
psql:/home/ttn/te/share/taler/sql/exchange/drop0001.sql:130: NOTICE:  drop cascades to constraint purse_deposits_coin_pub_fkey on table purse_deposits
psql:/home/ttn/te/share/taler/sql/exchange/drop0001.sql:135: NOTICE:  drop cascades to 2 other objects
DETAIL:  drop cascades to constraint history_requests_reserve_pub_fkey on table history_requests
drop cascades to constraint close_requests_reserve_pub_fkey on table close_requests
psql:/home/ttn/te/share/taler/sql/exchange/drop0001.sql:143: NOTICE:  drop cascades to 4 other objects
DETAIL:  drop cascades to constraint purse_merges_partner_serial_id_fkey on table purse_merges
drop cascades to constraint purse_deposits_partner_serial_id_fkey on table purse_deposits
drop cascades to constraint wads_out_partner_serial_id_fkey on table wads_out
drop cascades to constraint partner_accounts_partner_serial_id_fkey on table partner_accounts
psql:/home/ttn/te/share/taler/sql/auditor/drop0001.sql:42: NOTICE:  table "auditor_denominations" does not exist, skipping
2022-04-03T01:18:30.121796+0000 /home/ttn/build/GNU/T/exchange/src/testing/.libs/test_exchange_api_overlapping_keys_bug_cs-51227 WARNING Required port 8081 not available, skipping.
FAIL test_exchange_api_overlapping_keys_bug_cs (exit status: 1)

FAIL: test_exchange_api_overlapping_keys_bug_rsa
================================================

psql:/home/ttn/te/share/taler/sql/exchange/drop0001.sql:108: NOTICE:  drop cascades to constraint auditor_denom_sigs_auditor_uuid_fkey on table auditor_denom_sigs
psql:/home/ttn/te/share/taler/sql/exchange/drop0001.sql:110: NOTICE:  drop cascades to constraint signkey_revocations_esk_serial_fkey on table signkey_revocations
psql:/home/ttn/te/share/taler/sql/exchange/drop0001.sql:130: NOTICE:  drop cascades to constraint purse_deposits_coin_pub_fkey on table purse_deposits
psql:/home/ttn/te/share/taler/sql/exchange/drop0001.sql:135: NOTICE:  drop cascades to 2 other objects
DETAIL:  drop cascades to constraint history_requests_reserve_pub_fkey on table history_requests
drop cascades to constraint close_requests_reserve_pub_fkey on table close_requests
psql:/home/ttn/te/share/taler/sql/exchange/drop0001.sql:143: NOTICE:  drop cascades to 4 other objects
DETAIL:  drop cascades to constraint purse_merges_partner_serial_id_fkey on table purse_merges
drop cascades to constraint purse_deposits_partner_serial_id_fkey on table purse_deposits
drop cascades to constraint wads_out_partner_serial_id_fkey on table wads_out
drop cascades to constraint partner_accounts_partner_serial_id_fkey on table partner_accounts
psql:/home/ttn/te/share/taler/sql/auditor/drop0001.sql:42: NOTICE:  table "auditor_denominations" does not exist, skipping
2022-04-03T01:18:32.026282+0000 /home/ttn/build/GNU/T/exchange/src/testing/.libs/test_exchange_api_overlapping_keys_bug_rsa-51292 WARNING Required port 8081 not available, skipping.
FAIL test_exchange_api_overlapping_keys_bug_rsa (exit status: 1)

FAIL: test_exchange_management_api_cs
=====================================

2022-04-03T01:18:32.063744+0000 /home/ttn/build/GNU/T/exchange/src/testing/.libs/test_exchange_management_api_cs-51357 INFO Using fakebank http://localhost:9081/2/ on port 9081
2022-04-03T01:18:32.063997+0000 /home/ttn/build/GNU/T/exchange/src/testing/.libs/test_exchange_management_api_cs-51357 INFO exchange payto: payto://x-taler-bank/localhost/2
2022-04-03T01:18:32.064019+0000 /home/ttn/build/GNU/T/exchange/src/testing/.libs/test_exchange_management_api_cs-51357 INFO user42_payto: payto://x-taler-bank/localhost/42
2022-04-03T01:18:32.064025+0000 /home/ttn/build/GNU/T/exchange/src/testing/.libs/test_exchange_management_api_cs-51357 INFO user43_payto: payto://x-taler-bank/localhost/43
psql:/home/ttn/te/share/taler/sql/exchange/drop0001.sql:108: NOTICE:  drop cascades to constraint auditor_denom_sigs_auditor_uuid_fkey on table auditor_denom_sigs
psql:/home/ttn/te/share/taler/sql/exchange/drop0001.sql:110: NOTICE:  drop cascades to constraint signkey_revocations_esk_serial_fkey on table signkey_revocations
psql:/home/ttn/te/share/taler/sql/exchange/drop0001.sql:130: NOTICE:  drop cascades to constraint purse_deposits_coin_pub_fkey on table purse_deposits
psql:/home/ttn/te/share/taler/sql/exchange/drop0001.sql:135: NOTICE:  drop cascades to 2 other objects
DETAIL:  drop cascades to constraint history_requests_reserve_pub_fkey on table history_requests
drop cascades to constraint close_requests_reserve_pub_fkey on table close_requests
psql:/home/ttn/te/share/taler/sql/exchange/drop0001.sql:143: NOTICE:  drop cascades to 4 other objects
DETAIL:  drop cascades to constraint purse_merges_partner_serial_id_fkey on table purse_merges
drop cascades to constraint purse_deposits_partner_serial_id_fkey on table purse_deposits
drop cascades to constraint wads_out_partner_serial_id_fkey on table wads_out
drop cascades to constraint partner_accounts_partner_serial_id_fkey on table partner_accounts
psql:/home/ttn/te/share/taler/sql/auditor/drop0001.sql:42: NOTICE:  table "auditor_denominations" does not exist, skipping
2022-04-03T01:18:33.742573+0000 /home/ttn/build/GNU/T/exchange/src/testing/.libs/test_exchange_management_api_cs-51357 ERROR Unsupported extension `age_restriction` (section [exchange-extension-age_restriction]).
2022-04-03T01:18:33.778771+0000 /home/ttn/build/GNU/T/exchange/src/testing/.libs/test_exchange_management_api_cs-51357 WARNING Required port 8081 not available, skipping.
FAIL test_exchange_management_api_cs (exit status: 1)

FAIL: test_exchange_management_api_rsa
======================================

2022-04-03T01:18:33.827992+0000 /home/ttn/build/GNU/T/exchange/src/testing/.libs/test_exchange_management_api_rsa-51422 INFO Using fakebank http://localhost:9081/2/ on port 9081
2022-04-03T01:18:33.828390+0000 /home/ttn/build/GNU/T/exchange/src/testing/.libs/test_exchange_management_api_rsa-51422 INFO exchange payto: payto://x-taler-bank/localhost/2
2022-04-03T01:18:33.828410+0000 /home/ttn/build/GNU/T/exchange/src/testing/.libs/test_exchange_management_api_rsa-51422 INFO user42_payto: payto://x-taler-bank/localhost/42
2022-04-03T01:18:33.828419+0000 /home/ttn/build/GNU/T/exchange/src/testing/.libs/test_exchange_management_api_rsa-51422 INFO user43_payto: payto://x-taler-bank/localhost/43
psql:/home/ttn/te/share/taler/sql/exchange/drop0001.sql:108: NOTICE:  drop cascades to constraint auditor_denom_sigs_auditor_uuid_fkey on table auditor_denom_sigs
psql:/home/ttn/te/share/taler/sql/exchange/drop0001.sql:110: NOTICE:  drop cascades to constraint signkey_revocations_esk_serial_fkey on table signkey_revocations
psql:/home/ttn/te/share/taler/sql/exchange/drop0001.sql:130: NOTICE:  drop cascades to constraint purse_deposits_coin_pub_fkey on table purse_deposits
psql:/home/ttn/te/share/taler/sql/exchange/drop0001.sql:135: NOTICE:  drop cascades to 2 other objects
DETAIL:  drop cascades to constraint history_requests_reserve_pub_fkey on table history_requests
drop cascades to constraint close_requests_reserve_pub_fkey on table close_requests
psql:/home/ttn/te/share/taler/sql/exchange/drop0001.sql:143: NOTICE:  drop cascades to 4 other objects
DETAIL:  drop cascades to constraint purse_merges_partner_serial_id_fkey on table purse_merges
drop cascades to constraint purse_deposits_partner_serial_id_fkey on table purse_deposits
drop cascades to constraint wads_out_partner_serial_id_fkey on table wads_out
drop cascades to constraint partner_accounts_partner_serial_id_fkey on table partner_accounts
psql:/home/ttn/te/share/taler/sql/auditor/drop0001.sql:42: NOTICE:  table "auditor_denominations" does not exist, skipping
2022-04-03T01:18:35.498966+0000 /home/ttn/build/GNU/T/exchange/src/testing/.libs/test_exchange_management_api_rsa-51422 ERROR Unsupported extension `age_restriction` (section [exchange-extension-age_restriction]).
2022-04-03T01:18:35.539609+0000 /home/ttn/build/GNU/T/exchange/src/testing/.libs/test_exchange_management_api_rsa-51422 WARNING Required port 8081 not available, skipping.
FAIL test_exchange_management_api_rsa (exit status: 1)

FAIL: test_kyc_api
==================

2022-04-03T01:18:35.574968+0000 test-kyc-api-51488 INFO Using fakebank http://localhost:8082/2/ on port 8082
2022-04-03T01:18:35.575147+0000 test-kyc-api-51488 INFO exchange payto: payto://x-taler-bank/localhost/2
2022-04-03T01:18:35.575154+0000 test-kyc-api-51488 INFO user42_payto: payto://x-taler-bank/localhost/42
2022-04-03T01:18:35.575157+0000 test-kyc-api-51488 INFO user43_payto: payto://x-taler-bank/localhost/43
psql:/home/ttn/te/share/taler/sql/exchange/drop0001.sql:108: NOTICE:  drop cascades to constraint auditor_denom_sigs_auditor_uuid_fkey on table auditor_denom_sigs
psql:/home/ttn/te/share/taler/sql/exchange/drop0001.sql:110: NOTICE:  drop cascades to constraint signkey_revocations_esk_serial_fkey on table signkey_revocations
psql:/home/ttn/te/share/taler/sql/exchange/drop0001.sql:130: NOTICE:  drop cascades to constraint purse_deposits_coin_pub_fkey on table purse_deposits
psql:/home/ttn/te/share/taler/sql/exchange/drop0001.sql:135: NOTICE:  drop cascades to 2 other objects
DETAIL:  drop cascades to constraint history_requests_reserve_pub_fkey on table history_requests
drop cascades to constraint close_requests_reserve_pub_fkey on table close_requests
psql:/home/ttn/te/share/taler/sql/exchange/drop0001.sql:143: NOTICE:  drop cascades to 4 other objects
DETAIL:  drop cascades to constraint purse_merges_partner_serial_id_fkey on table purse_merges
drop cascades to constraint purse_deposits_partner_serial_id_fkey on table purse_deposits
drop cascades to constraint wads_out_partner_serial_id_fkey on table wads_out
drop cascades to constraint partner_accounts_partner_serial_id_fkey on table partner_accounts
psql:/home/ttn/te/share/taler/sql/auditor/drop0001.sql:42: NOTICE:  table "auditor_denominations" does not exist, skipping
2022-04-03T01:18:37.071049+0000 test-kyc-api-51488 WARNING Required port 8081 not available, skipping.
FAIL test_kyc_api (exit status: 1)

FAIL: test_taler_exchange_aggregator-postgres
=============================================

psql:/home/ttn/te/share/taler/sql/exchange/drop0001.sql:108: NOTICE:  drop cascades to constraint auditor_denom_sigs_auditor_uuid_fkey on table auditor_denom_sigs
psql:/home/ttn/te/share/taler/sql/exchange/drop0001.sql:110: NOTICE:  drop cascades to constraint signkey_revocations_esk_serial_fkey on table signkey_revocations
psql:/home/ttn/te/share/taler/sql/exchange/drop0001.sql:130: NOTICE:  drop cascades to constraint purse_deposits_coin_pub_fkey on table purse_deposits
psql:/home/ttn/te/share/taler/sql/exchange/drop0001.sql:135: NOTICE:  drop cascades to 2 other objects
DETAIL:  drop cascades to constraint history_requests_reserve_pub_fkey on table history_requests
drop cascades to constraint close_requests_reserve_pub_fkey on table close_requests
psql:/home/ttn/te/share/taler/sql/exchange/drop0001.sql:143: NOTICE:  drop cascades to 4 other objects
DETAIL:  drop cascades to constraint purse_merges_partner_serial_id_fkey on table purse_merges
drop cascades to constraint purse_deposits_partner_serial_id_fkey on table purse_deposits
drop cascades to constraint wads_out_partner_serial_id_fkey on table wads_out
drop cascades to constraint partner_accounts_partner_serial_id_fkey on table partner_accounts
psql:/home/ttn/te/share/taler/sql/auditor/drop0001.sql:42: NOTICE:  table "auditor_denominations" does not exist, skipping
2022-04-03T01:18:39.049691+0000 test_taler_exchange_aggregator-51553 INFO Using fakebank http://localhost:8082/2/ on port 8082
2022-04-03T01:18:39.050088+0000 test_taler_exchange_aggregator-51553 INFO exchange payto: payto://x-taler-bank/localhost/2
2022-04-03T01:18:39.050122+0000 test_taler_exchange_aggregator-51553 INFO user42_payto: payto://x-taler-bank/localhost/42
2022-04-03T01:18:39.050131+0000 test_taler_exchange_aggregator-51553 INFO user43_payto: payto://x-taler-bank/localhost/43
2022-04-03T01:18:39.051048+0000 test_taler_exchange_aggregator-51553 WARNING Required port 8081 not available, skipping.
2022-04-03T01:18:39.051105+0000 test_taler_exchange_aggregator-51553 WARNING Could not prepare database for tests.
FAIL test_taler_exchange_aggregator-postgres (exit status: 1)

FAIL: test_taler_exchange_wirewatch-postgres
============================================

2022-04-03T01:18:39.100696+0000 test_taler_exchange_wirewatch-51618 INFO Change in PQ event FD to -1
2022-04-03T01:18:39.100798+0000 test_taler_exchange_wirewatch-51618 INFO New poll FD is -1
2022-04-03T01:18:39.104492+0000 test_taler_exchange_wirewatch-51618 INFO Change in PQ event FD to 4
2022-04-03T01:18:39.104540+0000 test_taler_exchange_wirewatch-51618 INFO New poll FD is 4
psql:/home/ttn/te/share/taler/sql/exchange/drop0001.sql:108: NOTICE:  drop cascades to constraint auditor_denom_sigs_auditor_uuid_fkey on table auditor_denom_sigs
psql:/home/ttn/te/share/taler/sql/exchange/drop0001.sql:110: NOTICE:  drop cascades to constraint signkey_revocations_esk_serial_fkey on table signkey_revocations
psql:/home/ttn/te/share/taler/sql/exchange/drop0001.sql:130: NOTICE:  drop cascades to constraint purse_deposits_coin_pub_fkey on table purse_deposits
psql:/home/ttn/te/share/taler/sql/exchange/drop0001.sql:135: NOTICE:  drop cascades to 2 other objects
DETAIL:  drop cascades to constraint history_requests_reserve_pub_fkey on table history_requests
drop cascades to constraint close_requests_reserve_pub_fkey on table close_requests
psql:/home/ttn/te/share/taler/sql/exchange/drop0001.sql:143: NOTICE:  drop cascades to 4 other objects
DETAIL:  drop cascades to constraint purse_merges_partner_serial_id_fkey on table purse_merges
drop cascades to constraint purse_deposits_partner_serial_id_fkey on table purse_deposits
drop cascades to constraint wads_out_partner_serial_id_fkey on table wads_out
drop cascades to constraint partner_accounts_partner_serial_id_fkey on table partner_accounts
psql:/home/ttn/te/share/taler/sql/auditor/drop0001.sql:42: NOTICE:  table "auditor_denominations" does not exist, skipping
2022-04-03T01:18:41.065405+0000 test_taler_exchange_wirewatch-51618 INFO Using fakebank http://localhost:8082/2/ on port 8082
2022-04-03T01:18:41.065545+0000 test_taler_exchange_wirewatch-51618 INFO exchange payto: payto://x-taler-bank/localhost/2
2022-04-03T01:18:41.065551+0000 test_taler_exchange_wirewatch-51618 INFO user42_payto: payto://x-taler-bank/localhost/42
2022-04-03T01:18:41.065554+0000 test_taler_exchange_wirewatch-51618 INFO user43_payto: payto://x-taler-bank/localhost/43
2022-04-03T01:18:41.065827+0000 test_taler_exchange_wirewatch-51618 WARNING Required port 8081 not available, skipping.
FAIL test_taler_exchange_wirewatch-postgres (exit status: 1)

test-suite.log (37,879 bytes)   

ttn

2022-04-14 07:33

developer   ~0018874

This is superceded by 0007220. ("make check" still fails, but not 15 tests).

Issue History

Date Modified Username Field Change
2022-04-03 03:23 ttn New Issue
2022-04-03 03:23 ttn Status new => assigned
2022-04-03 03:23 ttn Assigned To => Christian Grothoff
2022-04-03 03:23 ttn File Added: .ttn.exchange-make-check.log
2022-04-03 03:23 ttn File Added: test-suite.log
2022-04-14 07:33 ttn Status assigned => resolved
2022-04-14 07:33 ttn Resolution open => fixed
2022-04-14 07:33 ttn Note Added: 0018874